null
SMILES: CCNC(=O)c1cnc2[nH]cc(-c3cccc(CNC(=O)c4cccn(Cc5ccc(F)c(F)c5)c4=O)c3)c2c1
InChI Key: InChIKey=OGDRRMOCJYXVDY-UHFFFAOYSA-N
Activity Spreadsheet -- Enzyme Inhibition Constant Data from BindingDB
Found 1 hit for monomerid = 366105
Trg + Lig
Ki
nM
ΔG°
kcal/mole
IC50
nM
Kd
nM
EC50/IC50
nM
koff
s-1
kon
M-1s-1
pHTemp
°C
3-phosphoinositide-dependent protein kinase 1 [51-360]
(Homo sapiens (Human))
BDBM366105
(US9873693, Compound 28)
Show SMILES CCNC(=O)c1cnc2[nH]cc(-c3cccc(CNC(=O)c4cccn(Cc5ccc(F)c(F)c5)c4=O)c3)c2c1
Show InChI InChI=1S/C30H25F2N5O3/c1-2-33-28(38)21-13-23-24(16-35-27(23)34-15-21)20-6-3-5-18(11-20)14-36-29(39)22-7-4-10-37(30(22)40)17-19-8-9-25(31)26(32)12-19/h3-13,15-16H,2,14,17H2,1H3,(H,33,38)(H,34,35)(H,36,39)
US Patent
n/an/a<500n/an/an/an/an/an/a
Duquesne University
Assay Description
A PDK1 kinase assay was performed as follows. PDK1 (amino acids 51-360) and AKT2 (amino acids 140-467 fused to PIFtide, amino acids EEQEMFRDFDYIADW) ...
J Med Chem 51: 68-76 (2008)
BindingDB Entry DOI: 10.7270/Q2H41TRT