BDBM36651 3-alkylaminoindazole cyclic urea, (i-Pr)
SMILES: CC(C)Nc1n[nH]c2ccc(CN3[C@H](Cc4ccccc4)[C@H](O)[C@@H](O)[C@@H](Cc4ccccc4)N(Cc4ccc5[nH]nc(NC(C)C)c5c4)C3=O)cc12
InChI Key: InChIKey=DQWBRZRJSHIBMA-RNATXAOGSA-N
Data: 1 KI
Activity Spreadsheet -- Enzyme Inhibition Constant Data from BindingDB
Found 1 hit for monomerid = 36651
Trg + Lig
Ki
nM
ΔG°
kcal/mole
IC50
nM
Kd
nM
EC50/IC50
nM
koff
s-1
kon
M-1s-1
pHTemp
°C
HIV-1 protease
(Human immunodeficiency virus)
BDBM36651
(3-alkylaminoindazole cyclic urea, (i-Pr))
Show SMILES CC(C)Nc1n[nH]c2ccc(CN3[C@H](Cc4ccccc4)[C@H](O)[C@@H](O)[C@@H](Cc4ccccc4)N(Cc4ccc5[nH]nc(NC(C)C)c5c4)C3=O)cc12 |r|
Show InChI InChI=1S/C41H48N8O3/c1-25(2)42-39-31-19-29(15-17-33(31)44-46-39)23-48-35(21-27-11-7-5-8-12-27)37(50)38(51)36(22-28-13-9-6-10-14-28)49(41(48)52)24-30-16-18-34-32(20-30)40(47-45-34)43-26(3)4/h5-20,25-26,35-38,50-51H,21-24H2,1-4H3,(H2,42,44,46)(H2,43,45,47)/t35-,36-,37+,38+/m1/s1
0.0900n/an/an/an/an/an/a5.5n/a
DuPont Merck Pharmaceutical Company
Assay Description
Protease inhibition fluorescence-based assay using cyclic ureas to inhibit HIV-protease.
Chem Biol 5: 597-608 (1998)
Article DOI: 10.1016/s1074-5521(98)90117-x
BindingDB Entry DOI: 10.7270/Q2R78CK2