null
SMILES: Nc1n[nH]c2ccc(CN3[C@H](Cc4ccccc4)[C@H](O)[C@@H](O)[C@@H](Cc4ccccc4)N(CC4CC4)C3=O)cc12
InChI Key: InChIKey=UJHRDVYTQSYBGT-GKQHHHCTSA-N
Activity Spreadsheet -- Enzyme Inhibition Constant Data from BindingDB
Found 2 hits for monomerid = 36655
Trg + Lig
Ki
nM
ΔG°
kcal/mole
IC50
nM
Kd
nM
EC50/IC50
nM
koff
s-1
kon
M-1s-1
pHTemp
°C
HIV-1 protease
(Human immunodeficiency virus)
BDBM36655
(Cyclopropylmethyl cyclic urea)
Show SMILES Nc1n[nH]c2ccc(CN3[C@H](Cc4ccccc4)[C@H](O)[C@@H](O)[C@@H](Cc4ccccc4)N(CC4CC4)C3=O)cc12 |r|
Show InChI InChI=1S/C31H35N5O3/c32-30-24-15-23(13-14-25(24)33-34-30)19-36-27(17-21-9-5-2-6-10-21)29(38)28(37)26(16-20-7-3-1-4-8-20)35(31(36)39)18-22-11-12-22/h1-10,13-15,22,26-29,37-38H,11-12,16-19H2,(H3,32,33,34)/t26-,27-,28+,29+/m1/s1
0.0200n/an/an/an/an/an/a5.5n/a
DuPont Merck Pharmaceutical Company
Assay Description
Protease inhibition fluorescence-based assay using cyclic ureas to inhibit HIV-protease.
Chem Biol 5: 597-608 (1998)
Article DOI: 10.1016/s1074-5521(98)90117-x
BindingDB Entry DOI: 10.7270/Q2R78CK2
Gag polyprotein
(Human immunodeficiency virus type 1 group M subtyp...)
BDBM36655
(Cyclopropylmethyl cyclic urea)
Show SMILES Nc1n[nH]c2ccc(CN3[C@H](Cc4ccccc4)[C@H](O)[C@@H](O)[C@@H](Cc4ccccc4)N(CC4CC4)C3=O)cc12 |r|
Show InChI InChI=1S/C31H35N5O3/c32-30-24-15-23(13-14-25(24)33-34-30)19-36-27(17-21-9-5-2-6-10-21)29(38)28(37)26(16-20-7-3-1-4-8-20)35(31(36)39)18-22-11-12-22/h1-10,13-15,22,26-29,37-38H,11-12,16-19H2,(H3,32,33,34)/t26-,27-,28+,29+/m1/s1
n/an/a 25n/an/an/an/a6.5n/a
DuPont Merck Pharmaceutical Company
Assay Description
Enzyme inhibition assay using cyclic ureas to inhibit GAG polyprotein.
Chem Biol 5: 597-608 (1998)
Article DOI: 10.1016/s1074-5521(98)90117-x
BindingDB Entry DOI: 10.7270/Q2R78CK2