BDBM3669 2-({4-[(3-bromophenyl)amino]pyrido[4,3-d]pyrimidin-7-yl}amino)acetic acid::4-[(3-Bromophenyl)amino]-7-[(carboxymethyl)amino]-pyrido[4,3-d]pyrimidine::pyrido[4,3-d]pyrimidine deriv. 3aa
SMILES: OC(=O)CNc1cc2ncnc(Nc3cccc(Br)c3)c2cn1
InChI Key: InChIKey=DNUPNCOEFDVRHA-UHFFFAOYSA-N
Data: 1 IC50
Activity Spreadsheet -- Enzyme Inhibition Constant Data from BindingDB
Found 1 hit for monomerid = 3669
Trg + Lig
Ki
nM
ΔG°
kcal/mole
IC50
nM
Kd
nM
EC50/IC50
nM
koff
s-1
kon
M-1s-1
pHTemp
°C
Epidermal growth factor receptor
(Homo sapiens (Human))
BDBM3669
(2-({4-[(3-bromophenyl)amino]pyrido[4,3-d]pyrimidin...)
Show SMILES OC(=O)CNc1cc2ncnc(Nc3cccc(Br)c3)c2cn1
Show InChI InChI=1S/C15H12BrN5O2/c16-9-2-1-3-10(4-9)21-15-11-6-17-13(18-7-14(22)23)5-12(11)19-8-20-15/h1-6,8H,7H2,(H,17,18)(H,22,23)(H,19,20,21)
n/an/a 1.5n/an/an/an/an/an/a
University of Auckland
Assay Description
IC50 is the inhibitor concentration which inhibits 50% of kinase activity that catalyzes the transfer of the terminal phosphate from [gamma-32P] labe...
J Med Chem 40: 3915-25 (1997)
Article DOI: 10.1021/jm970366v
BindingDB Entry DOI: 10.7270/Q2NS0S2V