BDBM36716 2-amino-4-[(naphthalen-2-yl)carbamoyl]butanoic acid
SMILES: NC(CCC(=O)Nc1ccc2ccccc2c1)C(O)=O
InChI Key: InChIKey=XWCSDVVHAXLZNL-UHFFFAOYSA-N
Data: 1 IC50
Activity Spreadsheet -- Enzyme Inhibition Constant Data from BindingDB
Found 1 hit for monomerid = 36716
Trg + Lig
Ki
nM
ΔG°
kcal/mole
IC50
nM
Kd
nM
EC50/IC50
nM
koff
s-1
kon
M-1s-1
pHTemp
°C
Thymidylate Synthase (TS)
(Lactobacillus casei)
BDBM36716
(2-amino-4-[(naphthalen-2-yl)carbamoyl]butanoic aci...)
Show SMILES NC(CCC(=O)Nc1ccc2ccccc2c1)C(O)=O
Show InChI InChI=1S/C15H16N2O3/c16-13(15(19)20)7-8-14(18)17-12-6-5-10-3-1-2-4-11(10)9-12/h1-6,9,13H,7-8,16H2,(H,17,18)(H,19,20)
n/an/a>5.00E+4n/an/an/an/a7.420
Northwestern University
Assay Description
The enzyme assay were performed spectrophotometrically by following the absorbance at 340nm using a hewlett Packard 8453 UV spectrophotometer equippe...
Chem Biol 6: 319-31 (1999)
Article DOI: 10.1016/S1074-5521(99)80077-5
BindingDB Entry DOI: 10.7270/Q2S180VB