BDBM367264 US10226464, Compound 32
SMILES: CCCCCCCOc1cc2oc3nc(=O)[nH]c(=O)c3cc2cc1F
InChI Key: InChIKey=ZLHCGUCPBDDVAD-UHFFFAOYSA-N
Data: 2 IC50
Activity Spreadsheet -- Enzyme Inhibition Constant Data from BindingDB
Found 2 hits for monomerid = 367264
Trg + Lig
Ki
nM
ΔG°
kcal/mole
IC50
nM
Kd
nM
EC50/IC50
nM
koff
s-1
kon
M-1s-1
pHTemp
°C
nf-kb gfp
(Homo sapiens (Human))
BDBM367264
(US10226464, Compound 32)
Show SMILES CCCCCCCOc1cc2oc3nc(=O)[nH]c(=O)c3cc2cc1F
Show InChI InChI=1S/C18H19FN2O4/c1-2-3-4-5-6-7-24-15-10-14-11(9-13(15)19)8-12-16(22)20-18(23)21-17(12)25-14/h8-10H,2-7H2,1H3,(H,20,22,23)
US Patent
n/an/a<5.00E+3n/an/an/an/an/an/a
Amgen
Assay Description
NFκB/Jurkat/GFP transcriptional reporter cell line was obtained from SBI System Biosciences. NF-κB/Jurkat/GFP™ Reporter cells (5×105 cells)...
Bioorg Med Chem Lett 17: 5384-9 (2007)
BindingDB Entry DOI: 10.7270/Q2028TVG
emsa
(Homo sapiens (Human))
BDBM367264
(US10226464, Compound 32)
Show SMILES CCCCCCCOc1cc2oc3nc(=O)[nH]c(=O)c3cc2cc1F
Show InChI InChI=1S/C18H19FN2O4/c1-2-3-4-5-6-7-24-15-10-14-11(9-13(15)19)8-12-16(22)20-18(23)21-17(12)25-14/h8-10H,2-7H2,1H3,(H,20,22,23)
US Patent
n/an/a<500n/an/an/an/an/an/a
Amgen
Assay Description
DNA binding reaction (20 μL) was carried out in 1×DNA Binding Buffer (10 mM Tris, 40 mM NaCl, 1 mM EDTA, 4% glycerol) with 10 nM c-Rel protein a...
Bioorg Med Chem Lett 17: 5384-9 (2007)
BindingDB Entry DOI: 10.7270/Q2028TVG