null
SMILES: CC(C)COc1ccc2cc3c(nc(=O)[nH]c3=O)oc2c1F
InChI Key: InChIKey=XFWWZCHCBAGSBE-UHFFFAOYSA-N
Activity Spreadsheet -- Enzyme Inhibition Constant Data from BindingDB
Found 2 hits for monomerid = 367281
Trg + Lig
Ki
nM
ΔG°
kcal/mole
IC50
nM
Kd
nM
EC50/IC50
nM
koff
s-1
kon
M-1s-1
pHTemp
°C
Nuclear factor NF-kappa-B p105 subunit
(Homo sapiens (Human))
BDBM367281
(US10226464, Compound 48)
Show SMILES CC(C)COc1ccc2cc3c(nc(=O)[nH]c3=O)oc2c1F
Show InChI InChI=1S/C15H13FN2O4/c1-7(2)6-21-10-4-3-8-5-9-13(19)17-15(20)18-14(9)22-12(8)11(10)16/h3-5,7H,6H2,1-2H3,(H,17,19,20)
US Patent
n/an/a<5.00E+3n/an/an/an/an/an/a
Amgen
Assay Description
NFκB/Jurkat/GFP transcriptional reporter cell line was obtained from SBI System Biosciences. NF-κB/Jurkat/GFP™ Reporter cells (5×105 cells)...
Bioorg Med Chem Lett 17: 5384-9 (2007)
BindingDB Entry DOI: 10.7270/Q2028TVG
Nuclear factor NF-kappa-B p105 subunit
(Homo sapiens (Human))
BDBM367281
(US10226464, Compound 48)
Show SMILES CC(C)COc1ccc2cc3c(nc(=O)[nH]c3=O)oc2c1F
Show InChI InChI=1S/C15H13FN2O4/c1-7(2)6-21-10-4-3-8-5-9-13(19)17-15(20)18-14(9)22-12(8)11(10)16/h3-5,7H,6H2,1-2H3,(H,17,19,20)
US Patent
n/an/a<500n/an/an/an/an/an/a
Amgen
Assay Description
DNA binding reaction (20 μL) was carried out in 1×DNA Binding Buffer (10 mM Tris, 40 mM NaCl, 1 mM EDTA, 4% glycerol) with 10 nM c-Rel protein a...
Bioorg Med Chem Lett 17: 5384-9 (2007)
BindingDB Entry DOI: 10.7270/Q2028TVG