BDBM367300 US10226464, Compound 67
SMILES: COCCCCOc1ccc2cc3c(nc(=O)[nH]c3=O)oc2c1
InChI Key: InChIKey=XJXIFIXILKADKH-UHFFFAOYSA-N
Data: 2 IC50
Activity Spreadsheet -- Enzyme Inhibition Constant Data from BindingDB
Found 2 hits for monomerid = 367300
Trg + Lig
Ki
nM
ΔG°
kcal/mole
IC50
nM
Kd
nM
EC50/IC50
nM
koff
s-1
kon
M-1s-1
pHTemp
°C
Nuclear factor NF-kappa-B (NF-kB)
(Homo sapiens (Human))
BDBM367300
(US10226464, Compound 67)
Show SMILES COCCCCOc1ccc2cc3c(nc(=O)[nH]c3=O)oc2c1
Show InChI InChI=1S/C16H16N2O5/c1-21-6-2-3-7-22-11-5-4-10-8-12-14(19)17-16(20)18-15(12)23-13(10)9-11/h4-5,8-9H,2-3,6-7H2,1H3,(H,17,19,20)
US Patent
n/an/a<5.00E+3n/an/an/an/an/an/a
Amgen
Assay Description
NFκB/Jurkat/GFP transcriptional reporter cell line was obtained from SBI System Biosciences. NF-κB/Jurkat/GFP™ Reporter cells (5×105 cells)...
Bioorg Med Chem Lett 17: 5384-9 (2007)
BindingDB Entry DOI: 10.7270/Q2028TVG
Nuclear factor NF-kappa-B (NF-kB)
(Homo sapiens (Human))
BDBM367300
(US10226464, Compound 67)
Show SMILES COCCCCOc1ccc2cc3c(nc(=O)[nH]c3=O)oc2c1
Show InChI InChI=1S/C16H16N2O5/c1-21-6-2-3-7-22-11-5-4-10-8-12-14(19)17-16(20)18-15(12)23-13(10)9-11/h4-5,8-9H,2-3,6-7H2,1H3,(H,17,19,20)
US Patent
n/an/a<1.00E+3n/an/an/an/an/an/a
Amgen
Assay Description
DNA binding reaction (20 μL) was carried out in 1×DNA Binding Buffer (10 mM Tris, 40 mM NaCl, 1 mM EDTA, 4% glycerol) with 10 nM c-Rel protein a...
Bioorg Med Chem Lett 17: 5384-9 (2007)
BindingDB Entry DOI: 10.7270/Q2028TVG