BDBM3676 4-N-(3-methylphenyl)-7-N-[3-(morpholin-4-yl)propyl]pyrido[4,3-d]pyrimidine-4,7-diamine::4-[(3-Methylphenyl)amino]-7-[[3-(4-morpholino)propyl]amino]pyrido[4,3-d]pyrimidine::pyrido[4,3-d]pyrimidine deriv. 4r
SMILES: Cc1cccc(Nc2ncnc3cc(NCCCN4CCOCC4)ncc23)c1
InChI Key: InChIKey=YBNNPKWJNJBQNZ-UHFFFAOYSA-N
Data: 1 IC50
Activity Spreadsheet -- Enzyme Inhibition Constant Data from BindingDB
Found 1 hit for monomerid = 3676
Trg + Lig
Ki
nM
ΔG°
kcal/mole
IC50
nM
Kd
nM
EC50/IC50
nM
koff
s-1
kon
M-1s-1
pHTemp
°C
Epidermal growth factor receptor
(Homo sapiens (Human))
BDBM3676
(4-N-(3-methylphenyl)-7-N-[3-(morpholin-4-yl)propyl...)
Show SMILES Cc1cccc(Nc2ncnc3cc(NCCCN4CCOCC4)ncc23)c1
Show InChI InChI=1S/C21H26N6O/c1-16-4-2-5-17(12-16)26-21-18-14-23-20(13-19(18)24-15-25-21)22-6-3-7-27-8-10-28-11-9-27/h2,4-5,12-15H,3,6-11H2,1H3,(H,22,23)(H,24,25,26)
n/an/a 9.30n/an/an/an/an/an/a
University of Auckland
Assay Description
IC50 is the inhibitor concentration which inhibits 50% of kinase activity that catalyzes the transfer of the terminal phosphate from [gamma-32P] labe...
J Med Chem 40: 3915-25 (1997)
Article DOI: 10.1021/jm970366v
BindingDB Entry DOI: 10.7270/Q2NS0S2V