BDBM36862 4-[4-[[2-(3-methyl-4-oxo-1-phthalazinyl)-1-oxoethyl]amino]phenyl]-1-piperazinecarboxylic acid tert-butyl ester::4-[4-[[2-(4-keto-3-methyl-phthalazin-1-yl)acetyl]amino]phenyl]piperazine-1-carboxylic acid tert-butyl ester::4-{4-[2-(3-Methyl-4-oxo-3,4-dihydro-phthalazin-1-yl)-acetylamino]-phenyl}-piperazine-1-carboxylic acid tert-butyl ester::MLS000030075::SMR000000785::cid_652457::tert-butyl 4-[4-[2-(3-methyl-4-oxidanylidene-phthalazin-1-yl)ethanoylamino]phenyl]piperazine-1-carboxylate::tert-butyl 4-[4-[[2-(3-methyl-4-oxophthalazin-1-yl)acetyl]amino]phenyl]piperazine-1-carboxylate
SMILES: Cn1nc(CC(=O)Nc2ccc(cc2)N2CCN(CC2)C(=O)OC(C)(C)C)c2ccccc2c1=O
InChI Key: InChIKey=WOPOMJOPBWTLLP-UHFFFAOYSA-N
Data: 7 IC50  3 EC50
Activity Spreadsheet -- Enzyme Inhibition Constant Data from BindingDB
Found 10 hits for monomerid = 36862
Trg + Lig
Ki
nM
ΔG°
kcal/mole
IC50
nM
Kd
nM
EC50/IC50
nM
koff
s-1
kon
M-1s-1
pHTemp
°C
Sphingosine 1-phosphate receptor 1
(Homo sapiens (Human))
BDBM36862
(4-[4-[[2-(3-methyl-4-oxo-1-phthalazinyl)-1-oxoethy...)
Show SMILES Cn1nc(CC(=O)Nc2ccc(cc2)N2CCN(CC2)C(=O)OC(C)(C)C)c2ccccc2c1=O
Show InChI InChI=1S/C26H31N5O4/c1-26(2,3)35-25(34)31-15-13-30(14-16-31)19-11-9-18(10-12-19)27-23(32)17-22-20-7-5-6-8-21(20)24(33)29(4)28-22/h5-12H,13-17H2,1-4H3,(H,27,32)
Reactome pathway
PCBioAssay
n/an/an/an/a>9.51E+4n/an/an/an/a
The Scripps Research Institute Molecular Screening Center
Curated by PubChem BioAssay
Assay Description
Source (MLSCN Center Name): The Scripps Research Institute Molecular Screening Center Center Affiliation: The Scripps Research Institute, TSRI Assay ...
PubChem Bioassay (2007)
BindingDB Entry DOI: 10.7270/Q25X2795
Sphingosine 1-phosphate receptor 1
(Homo sapiens (Human))
BDBM36862
(4-[4-[[2-(3-methyl-4-oxo-1-phthalazinyl)-1-oxoethy...)
Show SMILES Cn1nc(CC(=O)Nc2ccc(cc2)N2CCN(CC2)C(=O)OC(C)(C)C)c2ccccc2c1=O
Show InChI InChI=1S/C26H31N5O4/c1-26(2,3)35-25(34)31-15-13-30(14-16-31)19-11-9-18(10-12-19)27-23(32)17-22-20-7-5-6-8-21(20)24(33)29(4)28-22/h5-12H,13-17H2,1-4H3,(H,27,32)
Reactome pathway
PCBioAssay
n/an/an/an/a 1.33E+4n/an/an/an/a
The Scripps Research Institute Molecular Screening Center
Curated by PubChem BioAssay
Assay Description
Source (MLSCN Center Name): The Scripps Research Institute Molecular Screening Center Center Affiliation: The Scripps Research Institute, TSRI Assay ...
PubChem Bioassay (2007)
BindingDB Entry DOI: 10.7270/Q2251GJ9
Sphingosine 1-phosphate receptor 1
(Homo sapiens (Human))
BDBM36862
(4-[4-[[2-(3-methyl-4-oxo-1-phthalazinyl)-1-oxoethy...)
Show SMILES Cn1nc(CC(=O)Nc2ccc(cc2)N2CCN(CC2)C(=O)OC(C)(C)C)c2ccccc2c1=O
Show InChI InChI=1S/C26H31N5O4/c1-26(2,3)35-25(34)31-15-13-30(14-16-31)19-11-9-18(10-12-19)27-23(32)17-22-20-7-5-6-8-21(20)24(33)29(4)28-22/h5-12H,13-17H2,1-4H3,(H,27,32)
Reactome pathway
PCBioAssay
n/an/an/an/a 1.44E+4n/an/an/an/a
The Scripps Research Institute Molecular Screening Center
Curated by PubChem BioAssay
Assay Description
Source (MLSCN Center Name): The Scripps Research Institute Molecular Screening Center Center Affiliation: The Scripps Research Institute, TSRI Assay ...
PubChem Bioassay (2007)
BindingDB Entry DOI: 10.7270/Q2ZC817P
Nuclear receptor ROR-alpha
(Homo sapiens (Human))
BDBM36862
(4-[4-[[2-(3-methyl-4-oxo-1-phthalazinyl)-1-oxoethy...)
Show SMILES Cn1nc(CC(=O)Nc2ccc(cc2)N2CCN(CC2)C(=O)OC(C)(C)C)c2ccccc2c1=O
Show InChI InChI=1S/C26H31N5O4/c1-26(2,3)35-25(34)31-15-13-30(14-16-31)19-11-9-18(10-12-19)27-23(32)17-22-20-7-5-6-8-21(20)24(33)29(4)28-22/h5-12H,13-17H2,1-4H3,(H,27,32)
Reactome pathway
PCBioAssay
n/an/a 1.25E+3n/an/an/an/an/an/a
The Scripps Research Institute Molecular Screening Center
Curated by PubChem BioAssay
Assay Description
Source (MLSCN Center Name): The Scripps Research Institute Molecular Screening Center Center Affiliation: The Scripps Research Institute, TSRI Assay ...
PubChem Bioassay (2007)
BindingDB Entry DOI: 10.7270/Q2TH8K3N
Alpha trans-inducing protein (VP16)
(Human herpesvirus 1 (strain 17) (HHV-1) (Human her...)
BDBM36862
(4-[4-[[2-(3-methyl-4-oxo-1-phthalazinyl)-1-oxoethy...)
Show SMILES Cn1nc(CC(=O)Nc2ccc(cc2)N2CCN(CC2)C(=O)OC(C)(C)C)c2ccccc2c1=O
Show InChI InChI=1S/C26H31N5O4/c1-26(2,3)35-25(34)31-15-13-30(14-16-31)19-11-9-18(10-12-19)27-23(32)17-22-20-7-5-6-8-21(20)24(33)29(4)28-22/h5-12H,13-17H2,1-4H3,(H,27,32)
PCBioAssay
n/an/a 8.12E+4n/an/an/an/an/an/a
The Scripps Research Institute Molecular Screening Center
Curated by PubChem BioAssay
Assay Description
Source (MLPCN Center Name): The Scripps Research Institute Molecular Screening Center Affiliation: The Scripps Research Institute, TSRI Assay Provide...
PubChem Bioassay (2013)
BindingDB Entry DOI: 10.7270/Q2GM85ZT
Nuclear receptor ROR-alpha
(Homo sapiens (Human))
BDBM36862
(4-[4-[[2-(3-methyl-4-oxo-1-phthalazinyl)-1-oxoethy...)
Show SMILES Cn1nc(CC(=O)Nc2ccc(cc2)N2CCN(CC2)C(=O)OC(C)(C)C)c2ccccc2c1=O
Show InChI InChI=1S/C26H31N5O4/c1-26(2,3)35-25(34)31-15-13-30(14-16-31)19-11-9-18(10-12-19)27-23(32)17-22-20-7-5-6-8-21(20)24(33)29(4)28-22/h5-12H,13-17H2,1-4H3,(H,27,32)
Reactome pathway
PCBioAssay
n/an/a 2.42E+3n/an/an/an/an/an/a
The Scripps Research Institute Molecular Screening Center
Curated by PubChem BioAssay
Assay Description
Source (MLSCN Center Name): The Scripps Research Institute Molecular Screening Center Center Affiliation: The Scripps Research Institute, TSRI Assay ...
PubChem Bioassay (2007)
BindingDB Entry DOI: 10.7270/Q26Q1VNZ
Steroidogenic Factor 1
(Homo sapiens (Human))
BDBM36862
(4-[4-[[2-(3-methyl-4-oxo-1-phthalazinyl)-1-oxoethy...)
Show SMILES Cn1nc(CC(=O)Nc2ccc(cc2)N2CCN(CC2)C(=O)OC(C)(C)C)c2ccccc2c1=O
Show InChI InChI=1S/C26H31N5O4/c1-26(2,3)35-25(34)31-15-13-30(14-16-31)19-11-9-18(10-12-19)27-23(32)17-22-20-7-5-6-8-21(20)24(33)29(4)28-22/h5-12H,13-17H2,1-4H3,(H,27,32)
Reactome pathway
PCBioAssay
n/an/a 2.55E+3n/an/an/an/an/an/a
The Scripps Research Institute Molecular Screening Center
Curated by PubChem BioAssay
Assay Description
Source (MLSCN Center Name): The Scripps Research Institute Molecular Screening Center Center Affiliation: The Scripps Research Institute, TSRI Assay ...
PubChem Bioassay (2007)
BindingDB Entry DOI: 10.7270/Q2319T8T
neutrophil cytosolic factor 1
(Homo sapiens (Human))
BDBM36862
(4-[4-[[2-(3-methyl-4-oxo-1-phthalazinyl)-1-oxoethy...)
Show SMILES Cn1nc(CC(=O)Nc2ccc(cc2)N2CCN(CC2)C(=O)OC(C)(C)C)c2ccccc2c1=O
Show InChI InChI=1S/C26H31N5O4/c1-26(2,3)35-25(34)31-15-13-30(14-16-31)19-11-9-18(10-12-19)27-23(32)17-22-20-7-5-6-8-21(20)24(33)29(4)28-22/h5-12H,13-17H2,1-4H3,(H,27,32)
Reactome pathway
PCBioAssay
n/an/a 5.00E+4n/an/an/an/an/an/a
Emory University Molecular Libraries Screening Center
Curated by PubChem BioAssay
Assay Description
NIH Molecular Libraries Screening Centers Network [MLSCN] Emory Chemical Biology Discovery Center in MLSCN Assay provider: Susan Smith, Emory Univers...
PubChem Bioassay (2008)
BindingDB Entry DOI: 10.7270/Q2M90723
COUP transcription factor 2 isoform a
(Homo sapiens (Human))
BDBM36862
(4-[4-[[2-(3-methyl-4-oxo-1-phthalazinyl)-1-oxoethy...)
Show SMILES Cn1nc(CC(=O)Nc2ccc(cc2)N2CCN(CC2)C(=O)OC(C)(C)C)c2ccccc2c1=O
Show InChI InChI=1S/C26H31N5O4/c1-26(2,3)35-25(34)31-15-13-30(14-16-31)19-11-9-18(10-12-19)27-23(32)17-22-20-7-5-6-8-21(20)24(33)29(4)28-22/h5-12H,13-17H2,1-4H3,(H,27,32)
Reactome pathway
PCBioAssay
n/an/a 4.32E+3n/an/an/an/an/an/a
The Scripps Research Institute Molecular Screening Center
Curated by PubChem BioAssay
PubChem Bioassay (2013)
BindingDB Entry DOI: 10.7270/Q21Z431S
Steroidogenic Factor 1
(Homo sapiens (Human))
BDBM36862
(4-[4-[[2-(3-methyl-4-oxo-1-phthalazinyl)-1-oxoethy...)
Show SMILES Cn1nc(CC(=O)Nc2ccc(cc2)N2CCN(CC2)C(=O)OC(C)(C)C)c2ccccc2c1=O
Show InChI InChI=1S/C26H31N5O4/c1-26(2,3)35-25(34)31-15-13-30(14-16-31)19-11-9-18(10-12-19)27-23(32)17-22-20-7-5-6-8-21(20)24(33)29(4)28-22/h5-12H,13-17H2,1-4H3,(H,27,32)
Reactome pathway
PCBioAssay
n/an/a 2.55E+3n/an/an/an/an/an/a
The Scripps Research Institute Molecular Screening Center
Curated by PubChem BioAssay
Assay Description
Source (MLSCN Center Name): The Scripps Research Institute Molecular Screening Center Center Affiliation: The Scripps Research Institute, TSRI Assay ...
PubChem Bioassay (2007)
BindingDB Entry DOI: 10.7270/Q2PR7TCX