BDBM3702 3-({4-[(3-bromophenyl)amino]pyrido[3,4-d]pyrimidin-6-yl}amino)propane-1,2-diol::4-[(3-Bromophenyl)amino]-6-[(2,3-dihydroxypropyl)-amino]pyrido[3,4-d]pyrimidine::PD158780 Analog 5f
SMILES: OCC(O)CNc1cc2c(Nc3cccc(Br)c3)ncnc2cn1
InChI Key: InChIKey=OJFNYXBTRFDYPU-UHFFFAOYSA-N
Data: 1 IC50
Activity Spreadsheet -- Enzyme Inhibition Constant Data from BindingDB
Found 1 hit for monomerid = 3702
Trg + Lig
Ki
nM
ΔG°
kcal/mole
IC50
nM
Kd
nM
EC50/IC50
nM
koff
s-1
kon
M-1s-1
pHTemp
°C
Epidermal growth factor receptor
(Homo sapiens (Human))
BDBM3702
(3-({4-[(3-bromophenyl)amino]pyrido[3,4-d]pyrimidin...)
Show SMILES OCC(O)CNc1cc2c(Nc3cccc(Br)c3)ncnc2cn1
Show InChI InChI=1S/C16H16BrN5O2/c17-10-2-1-3-11(4-10)22-16-13-5-15(18-6-12(24)8-23)19-7-14(13)20-9-21-16/h1-5,7,9,12,23-24H,6,8H2,(H,18,19)(H,20,21,22)
n/an/a 0.180n/an/an/an/a7.422
University of Auckland
Assay Description
IC50 is the inhibitor concentration which inhibits 50% of kinase activity that catalyzes the transfer of the terminal phosphate from [gamma-32P] labe...
J Med Chem 41: 742-51 (1998)
Article DOI: 10.1021/jm970641d
BindingDB Entry DOI: 10.7270/Q2DB800T