BDBM3714 2-{[3-({4-[(3-bromophenyl)amino]pyrido[3,4-d]pyrimidin-6-yl}amino)propyl](2-hydroxyethyl)amino}ethan-1-ol::4-[(3-Bromophenyl)amino]-6-[[3-[N,N-bis(2-hydroxyethyl)amino]propyl]amino]pyrido[3,4-d]pyrimidine::PD158780 Analog 5r
SMILES: OCCN(CCO)CCCNc1cc2c(Nc3cccc(Br)c3)ncnc2cn1
InChI Key: InChIKey=YQPDGPGZDSDTPY-UHFFFAOYSA-N
Data: 1 IC50
Activity Spreadsheet -- Enzyme Inhibition Constant Data from BindingDB
Found 1 hit for monomerid = 3714
Trg + Lig
Ki
nM
ΔG°
kcal/mole
IC50
nM
Kd
nM
EC50/IC50
nM
koff
s-1
kon
M-1s-1
pHTemp
°C
Epidermal growth factor receptor
(Homo sapiens (Human))
BDBM3714
(2-{[3-({4-[(3-bromophenyl)amino]pyrido[3,4-d]pyrim...)
Show SMILES OCCN(CCO)CCCNc1cc2c(Nc3cccc(Br)c3)ncnc2cn1
Show InChI InChI=1S/C20H25BrN6O2/c21-15-3-1-4-16(11-15)26-20-17-12-19(23-13-18(17)24-14-25-20)22-5-2-6-27(7-9-28)8-10-29/h1,3-4,11-14,28-29H,2,5-10H2,(H,22,23)(H,24,25,26)
n/an/a 0.350n/an/an/an/a7.422
University of Auckland
Assay Description
IC50 is the inhibitor concentration which inhibits 50% of kinase activity that catalyzes the transfer of the terminal phosphate from [gamma-32P] labe...
J Med Chem 41: 742-51 (1998)
Article DOI: 10.1021/jm970641d
BindingDB Entry DOI: 10.7270/Q2DB800T