BDBM371521 4-chloro-2-methyl-5-((1-methylazepan-3-yl)amino)pyridazin-3(2H)-one::US10239861, Example 1::US10239861, Example 12
SMILES: CN1CCCCC(C1)Nc1cnn(C)c(=O)c1Cl
InChI Key: InChIKey=FFWRQIIGTISRFA-UHFFFAOYSA-N
Data: 2 IC50
Activity Spreadsheet -- Enzyme Inhibition Constant Data from BindingDB
Found 2 hits for monomerid = 371521
Trg + Lig
Ki
nM
ΔG°
kcal/mole
IC50
nM
Kd
nM
EC50/IC50
nM
koff
s-1
kon
M-1s-1
pHTemp
°C
Histone acetyltransferase KAT2B
(Homo sapiens (Human))
BDBM371521
(4-chloro-2-methyl-5-((1-methylazepan-3-yl)amino)py...)
Show SMILES CN1CCCCC(C1)Nc1cnn(C)c(=O)c1Cl
Show InChI InChI=1S/C12H19ClN4O/c1-16-6-4-3-5-9(8-16)15-10-7-14-17(2)12(18)11(10)13/h7,9,15H,3-6,8H2,1-2H3
NCI pathway
Reactome pathway
US Patent
n/an/a 165n/an/an/an/an/an/a
GLSynthesis Inc.
Assay Description
His/Flag epitope tagged PCAF719-832 bromodomain was cloned, expressed and purified to homogeneity in-house. PCAF bromodomain binding and inhibition o...
J Med Chem 48: 3919-29 (2005)
BindingDB Entry DOI: 10.7270/Q2X06991
Histone acetyltransferase KAT2B
(Homo sapiens (Human))
BDBM371521
(4-chloro-2-methyl-5-((1-methylazepan-3-yl)amino)py...)
Show SMILES CN1CCCCC(C1)Nc1cnn(C)c(=O)c1Cl
Show InChI InChI=1S/C12H19ClN4O/c1-16-6-4-3-5-9(8-16)15-10-7-14-17(2)12(18)11(10)13/h7,9,15H,3-6,8H2,1-2H3
NCI pathway
Reactome pathway
US Patent
n/an/a 62n/an/an/an/an/an/a
GLSynthesis Inc.
Assay Description
His/Flag epitope tagged PCAF719-832 bromodomain was cloned, expressed and purified to homogeneity in-house. PCAF bromodomain binding and inhibition o...
J Med Chem 48: 3919-29 (2005)
BindingDB Entry DOI: 10.7270/Q2X06991