BDBM371523 (R)-N-(6-Fluoropyridin-2-yl)-4-(2-(1-methyl-1H-pyrazol-5-yl)-4-(trifluoromethyl)phenyl)chroman-7-sulfonamide::US10239869, Example 2
SMILES: Cn1nccc1-c1cc(ccc1[C@H]1CCOc2cc(ccc12)S(=O)(=O)Nc1cccc(F)n1)C(F)(F)F
InChI Key: InChIKey=ZDBDILFMVHVHPE-GOSISDBHSA-N
Data: 2 IC50
Activity Spreadsheet -- Enzyme Inhibition Constant Data from BindingDB
Found 2 hits for monomerid = 371523
Trg + Lig
Ki
nM
ΔG°
kcal/mole
IC50
nM
Kd
nM
EC50/IC50
nM
koff
s-1
kon
M-1s-1
pHTemp
°C
Sodium channel protein type 9 subunit alpha
(Homo sapiens (Human))
BDBM371523
((R)-N-(6-Fluoropyridin-2-yl)-4-(2-(1-methyl-1H-pyr...)
Show SMILES Cn1nccc1-c1cc(ccc1[C@H]1CCOc2cc(ccc12)S(=O)(=O)Nc1cccc(F)n1)C(F)(F)F
Show InChI InChI=1S/C25H20F4N4O3S/c1-33-21(9-11-30-33)20-13-15(25(27,28)29)5-7-17(20)18-10-12-36-22-14-16(6-8-19(18)22)37(34,35)32-24-4-2-3-23(26)31-24/h2-9,11,13-14,18H,10,12H2,1H3,(H,31,32)/t18-/m1/s1
n/an/a 0.600n/an/an/an/an/an/a
Lupin Ltd.
Curated by ChEMBL
Assay Description
Inhibition of Nav1.7 (unknown origin) expressed in HEK293 cells assessed as reduction in veratridine-induced depolarization preincubated for 15 to 20...
J Med Chem 63: 6107-6133 (2020)
Sodium channel protein type 9 subunit alpha
(Homo sapiens (Human))
BDBM371523
((R)-N-(6-Fluoropyridin-2-yl)-4-(2-(1-methyl-1H-pyr...)
Show SMILES Cn1nccc1-c1cc(ccc1[C@H]1CCOc2cc(ccc12)S(=O)(=O)Nc1cccc(F)n1)C(F)(F)F
Show InChI InChI=1S/C25H20F4N4O3S/c1-33-21(9-11-30-33)20-13-15(25(27,28)29)5-7-17(20)18-10-12-36-22-14-16(6-8-19(18)22)37(34,35)32-24-4-2-3-23(26)31-24/h2-9,11,13-14,18H,10,12H2,1H3,(H,31,32)/t18-/m1/s1
US Patent
n/an/a 0.300n/an/an/an/an/an/a
University of California at San Francisco
Assay Description
HEK-293 cells overexpressing the channel of interest were seeded in a 96-well plate at a density of 30000 cells/well and incubated at 37° C./5% CO2 f...
J Med Chem 51: 545-52 (2008)
BindingDB Entry DOI: 10.7270/Q2NG4SZX