BDBM371614 (R)-4-(2-(6-Fluoropyridin-3-yl)-4-(trifluoromethyl)phenyl)-N-(5-fluoropyrimidin-2-yl) chromane-7-sulfonamide::US10239869, Example 38
SMILES: Fc1cnc(NS(=O)(=O)c2ccc3[C@H](CCOc3c2)c2ccc(cc2-c2ccc(F)nc2)C(F)(F)F)nc1
InChI Key: InChIKey=ZRPPQZMKRPMVNX-LJQANCHMSA-N
Data: 3 IC50
Activity Spreadsheet -- Enzyme Inhibition Constant Data from BindingDB
Found 3 hits for monomerid = 371614
Trg + Lig
Ki
nM
ΔG°
kcal/mole
IC50
nM
Kd
nM
EC50/IC50
nM
koff
s-1
kon
M-1s-1
pHTemp
°C
Sodium channel protein type 9 subunit alpha
(Homo sapiens (Human))
BDBM371614
((R)-4-(2-(6-Fluoropyridin-3-yl)-4-(trifluoromethyl...)
Show SMILES Fc1cnc(NS(=O)(=O)c2ccc3[C@H](CCOc3c2)c2ccc(cc2-c2ccc(F)nc2)C(F)(F)F)nc1
Show InChI InChI=1S/C25H17F5N4O3S/c26-16-12-32-24(33-13-16)34-38(35,36)17-3-5-20-19(7-8-37-22(20)10-17)18-4-2-15(25(28,29)30)9-21(18)14-1-6-23(27)31-11-14/h1-6,9-13,19H,7-8H2,(H,32,33,34)/t19-/m1/s1
US Patent
n/an/a 2n/an/an/an/an/an/a
University of California at San Francisco
Assay Description
HEK-293 cells overexpressing the channel of interest were seeded in a 96-well plate at a density of 30000 cells/well and incubated at 37° C./5% CO2 f...
J Med Chem 51: 545-52 (2008)
BindingDB Entry DOI: 10.7270/Q2NG4SZX
Sodium channel protein type 9 subunit alpha
(Homo sapiens (Human))
BDBM371614
((R)-4-(2-(6-Fluoropyridin-3-yl)-4-(trifluoromethyl...)
Show SMILES Fc1cnc(NS(=O)(=O)c2ccc3[C@H](CCOc3c2)c2ccc(cc2-c2ccc(F)nc2)C(F)(F)F)nc1
Show InChI InChI=1S/C25H17F5N4O3S/c26-16-12-32-24(33-13-16)34-38(35,36)17-3-5-20-19(7-8-37-22(20)10-17)18-4-2-15(25(28,29)30)9-21(18)14-1-6-23(27)31-11-14/h1-6,9-13,19H,7-8H2,(H,32,33,34)/t19-/m1/s1
n/an/a 2.80n/an/an/an/an/an/a
Lupin Ltd.
Curated by ChEMBL
Assay Description
Inhibition of Nav1.7 (unknown origin) expressed in HEK293 cells assessed as reduction in veratridine-induced depolarization preincubated for 15 to 20...
J Med Chem 63: 6107-6133 (2020)
Sodium channel protein type 5 subunit alpha
(Homo sapiens (Human))
BDBM371614
((R)-4-(2-(6-Fluoropyridin-3-yl)-4-(trifluoromethyl...)
Show SMILES Fc1cnc(NS(=O)(=O)c2ccc3[C@H](CCOc3c2)c2ccc(cc2-c2ccc(F)nc2)C(F)(F)F)nc1
Show InChI InChI=1S/C25H17F5N4O3S/c26-16-12-32-24(33-13-16)34-38(35,36)17-3-5-20-19(7-8-37-22(20)10-17)18-4-2-15(25(28,29)30)9-21(18)14-1-6-23(27)31-11-14/h1-6,9-13,19H,7-8H2,(H,32,33,34)/t19-/m1/s1
US Patent
n/an/a>1.00E+4n/an/an/an/an/an/a
University of California at San Francisco
Assay Description
HEK-293 cells overexpressing the channel of interest were seeded in a 96-well plate at a density of 30000 cells/well and incubated at 37° C./5% CO2 f...
J Med Chem 51: 545-52 (2008)
BindingDB Entry DOI: 10.7270/Q2NG4SZX