null
SMILES: CN1CCC(CC1)Oc1ccc(Nc2ncc3[nH]c(cc3n2)-c2ccccc2C)cc1
InChI Key: InChIKey=AMDFLHAIQPFUKC-UHFFFAOYSA-N
Activity Spreadsheet -- Enzyme Inhibition Constant Data from BindingDB
Found 2 hits for monomerid = 372149
Trg + Lig
Ki
nM
ΔG°
kcal/mole
IC50
nM
Kd
nM
EC50/IC50
nM
koff
s-1
kon
M-1s-1
pHTemp
°C
Receptor-interacting serine/threonine-protein kinase 2
(Homo sapiens (Human))
BDBM372149
(N-(4-((1- methylpiperidin-4- yl)oxy)phenyl)-6- (o-...)
Show SMILES CN1CCC(CC1)Oc1ccc(Nc2ncc3[nH]c(cc3n2)-c2ccccc2C)cc1
Show InChI InChI=1S/C25H27N5O/c1-17-5-3-4-6-21(17)22-15-23-24(28-22)16-26-25(29-23)27-18-7-9-19(10-8-18)31-20-11-13-30(2)14-12-20/h3-10,15-16,20,28H,11-14H2,1-2H3,(H,26,27,29)
US Patent
n/an/a<100n/an/an/an/an/an/a
UNIVERSITY HEALTH NETWORK
US Patent
Assay Description
Active RIPK2 was purchased from Life Technologies as His-tagged of catalytic domain (amin acids 1-299) of human RIPK2 kinase expressed in insect cell...
US Patent US10875863 (2020)
Receptor-interacting serine/threonine-protein kinase 2
(Homo sapiens (Human))
BDBM372149
(N-(4-((1- methylpiperidin-4- yl)oxy)phenyl)-6- (o-...)
Show SMILES CN1CCC(CC1)Oc1ccc(Nc2ncc3[nH]c(cc3n2)-c2ccccc2C)cc1
Show InChI InChI=1S/C25H27N5O/c1-17-5-3-4-6-21(17)22-15-23-24(28-22)16-26-25(29-23)27-18-7-9-19(10-8-18)31-20-11-13-30(2)14-12-20/h3-10,15-16,20,28H,11-14H2,1-2H3,(H,26,27,29)
US Patent
n/an/a<100n/an/an/an/an/an/a
National Taiwan University
Assay Description
RIPK2 activity was measured using an indirect ELISA detection system. His—RIPK2 (0.6 nM) was incubated in the presence of 6 μM ATP (Sigma cat # ...
J Med Chem 51: 2795-806 (2008)
BindingDB Entry DOI: 10.7270/Q289186K