BDBM372339 Preparation of diastereomeric (1R)- and (1S)-1-(fluoromethyl)-4-((1R,3aS,5aR,5bR,7aR,11aS,11bR,13aR,13bR)-5a,5b,8,8,11a-pentamethyl-3a-((2-(4-(methylsulfonyl)piperidin-1-yl)ethyl)amino)-1-(prop-1-en-2-yl)-2,3,3a,4,5,5a,5b,6,7,7a,8,11,11a,11b,12,13,13a,13b-octadecahydro-1H-cyclopenta[a]chrysen-9-yl)cyclohex-3-enecarboxylic acid::US10245275, Example 1
SMILES: CC(=C)[C@@H]1CC[C@@]2(CC[C@]3(C)[C@H](CC[C@@H]4[C@@]5(C)CC=C(C6=CCC(CF)(CC6)C(O)=O)C(C)(C)[C@@H]5CC[C@@]34C)[C@@H]12)NCCN1CCC(CC1)S(C)(=O)=O
InChI Key: InChIKey=GXCQXEGPZPHUSE-CFVWSTMISA-N
Data: 2 EC50
Activity Spreadsheet -- Enzyme Inhibition Constant Data from BindingDB
Found 2 hits for monomerid = 372339
Trg + Lig
Ki
nM
ΔG°
kcal/mole
IC50
nM
Kd
nM
EC50/IC50
nM
koff
s-1
kon
M-1s-1
pHTemp
°C
Gag-Pol polyprotein [A364V]
(Human immunodeficiency virus type 1 group M subtyp...)
BDBM372339
(Preparation of diastereomeric (1R)- and (1S)-1-(fl...)
Show SMILES CC(=C)[C@@H]1CC[C@@]2(CC[C@]3(C)[C@H](CC[C@@H]4[C@@]5(C)CC=C(C6=CCC(CF)(CC6)C(O)=O)C(C)(C)[C@@H]5CC[C@@]34C)[C@@H]12)NCCN1CCC(CC1)S(C)(=O)=O |r,w:23.23,t:18,20|
Show InChI InChI=1S/C45H71FN2O4S/c1-30(2)33-13-22-45(47-25-28-48-26-16-32(17-27-48)53(8,51)52)24-23-42(6)35(38(33)45)9-10-37-41(5)18-14-34(40(3,4)36(41)15-19-43(37,42)7)31-11-20-44(29-46,21-12-31)39(49)50/h11,14,32-33,35-38,47H,1,9-10,12-13,15-29H2,2-8H3,(H,49,50)/t33-,35+,36-,37+,38+,41-,42+,43+,44?,45-/m0/s1
US Patent
n/an/an/an/a 123n/an/an/an/a
Bristol-Myers Squibb Company
Assay Description
MT-2 cells and 293T cells were obtained from the NIH AIDS Research and Reference Reagent Program. MT-2 cells were propagated in RPMI 1640 media suppl...
Bioorg Med Chem Lett 15: 1435-40 (2005)
BindingDB Entry DOI: 10.7270/Q2MK6G6T
Gag-Pol polyprotein
(Human immunodeficiency virus type 1 group M subtyp...)
BDBM372339
(Preparation of diastereomeric (1R)- and (1S)-1-(fl...)
Show SMILES CC(=C)[C@@H]1CC[C@@]2(CC[C@]3(C)[C@H](CC[C@@H]4[C@@]5(C)CC=C(C6=CCC(CF)(CC6)C(O)=O)C(C)(C)[C@@H]5CC[C@@]34C)[C@@H]12)NCCN1CCC(CC1)S(C)(=O)=O |r,w:23.23,t:18,20|
Show InChI InChI=1S/C45H71FN2O4S/c1-30(2)33-13-22-45(47-25-28-48-26-16-32(17-27-48)53(8,51)52)24-23-42(6)35(38(33)45)9-10-37-41(5)18-14-34(40(3,4)36(41)15-19-43(37,42)7)31-11-20-44(29-46,21-12-31)39(49)50/h11,14,32-33,35-38,47H,1,9-10,12-13,15-29H2,2-8H3,(H,49,50)/t33-,35+,36-,37+,38+,41-,42+,43+,44?,45-/m0/s1
US Patent
n/an/an/an/a 1.75n/an/an/an/a
Bristol-Myers Squibb Company
Assay Description
MT-2 cells and 293T cells were obtained from the NIH AIDS Research and Reference Reagent Program. MT-2 cells were propagated in RPMI 1640 media suppl...
Bioorg Med Chem Lett 15: 1435-40 (2005)
BindingDB Entry DOI: 10.7270/Q2MK6G6T