BDBM37278 (6E)-4-amino-6-(5-isopropyl-3H-1,3-benzoxazol-2-ylidene)cyclohexa-2,4-dien-1-one::(6E)-4-amino-6-(5-propan-2-yl-3H-1,3-benzoxazol-2-ylidene)-1-cyclohexa-2,4-dienone::(6E)-4-amino-6-(5-propan-2-yl-3H-1,3-benzoxazol-2-ylidene)cyclohexa-2,4-dien-1-one::(6E)-4-azanyl-6-(5-propan-2-yl-3H-1,3-benzoxazol-2-ylidene)cyclohexa-2,4-dien-1-one::MLS000111297::SMR000107222::cid_5411262
SMILES: CC(C)c1ccc2oc(nc2c1)-c1cc(N)ccc1O
InChI Key: InChIKey=KCMRQRBEYMBAAY-UHFFFAOYSA-N
Data: 2 IC50  3 EC50
Activity Spreadsheet -- Enzyme Inhibition Constant Data from BindingDB
Found 5 hits for monomerid = 37278
Trg + Lig
Ki
nM
ΔG°
kcal/mole
IC50
nM
Kd
nM
EC50/IC50
nM
koff
s-1
kon
M-1s-1
pHTemp
°C
Sphingosine 1-phosphate receptor 1
(Homo sapiens (Human))
BDBM37278
((6E)-4-amino-6-(5-isopropyl-3H-1,3-benzoxazol-2-yl...)
Show SMILES CC(C)c1ccc2oc(nc2c1)-c1cc(N)ccc1O
Show InChI InChI=1S/C16H16N2O2/c1-9(2)10-3-6-15-13(7-10)18-16(20-15)12-8-11(17)4-5-14(12)19/h3-9,19H,17H2,1-2H3
Reactome pathway
PCBioAssay
n/an/an/an/a 9.39E+3n/an/an/an/a
The Scripps Research Institute Molecular Screening Center
Curated by PubChem BioAssay
Assay Description
Source (MLSCN Center Name): The Scripps Research Institute Molecular Screening Center Center Affiliation: The Scripps Research Institute, TSRI Assay ...
PubChem Bioassay (2007)
BindingDB Entry DOI: 10.7270/Q2ZC817P
Sphingosine 1-phosphate receptor 1
(Homo sapiens (Human))
BDBM37278
((6E)-4-amino-6-(5-isopropyl-3H-1,3-benzoxazol-2-yl...)
Show SMILES CC(C)c1ccc2oc(nc2c1)-c1cc(N)ccc1O
Show InChI InChI=1S/C16H16N2O2/c1-9(2)10-3-6-15-13(7-10)18-16(20-15)12-8-11(17)4-5-14(12)19/h3-9,19H,17H2,1-2H3
Reactome pathway
PCBioAssay
n/an/an/an/a>3.00E+4n/an/an/an/a
The Scripps Research Institute Molecular Screening Center
Curated by PubChem BioAssay
Assay Description
Source (MLSCN Center Name): The Scripps Research Institute Molecular Screening Center Center Affiliation: The Scripps Research Institute, TSRI Assay ...
PubChem Bioassay (2007)
BindingDB Entry DOI: 10.7270/Q25X2795
Nuclear receptor ROR-alpha
(Homo sapiens (Human))
BDBM37278
((6E)-4-amino-6-(5-isopropyl-3H-1,3-benzoxazol-2-yl...)
Show SMILES CC(C)c1ccc2oc(nc2c1)-c1cc(N)ccc1O
Show InChI InChI=1S/C16H16N2O2/c1-9(2)10-3-6-15-13(7-10)18-16(20-15)12-8-11(17)4-5-14(12)19/h3-9,19H,17H2,1-2H3
Reactome pathway
PCBioAssay
n/an/a>3.67E+3n/an/an/an/an/an/a
The Scripps Research Institute Molecular Screening Center
Curated by PubChem BioAssay
Assay Description
Source (MLSCN Center Name): The Scripps Research Institute Molecular Screening Center Center Affiliation: The Scripps Research Institute, TSRI Assay ...
PubChem Bioassay (2007)
BindingDB Entry DOI: 10.7270/Q26Q1VNZ
Steroidogenic Factor 1
(Homo sapiens (Human))
BDBM37278
((6E)-4-amino-6-(5-isopropyl-3H-1,3-benzoxazol-2-yl...)
Show SMILES CC(C)c1ccc2oc(nc2c1)-c1cc(N)ccc1O
Show InChI InChI=1S/C16H16N2O2/c1-9(2)10-3-6-15-13(7-10)18-16(20-15)12-8-11(17)4-5-14(12)19/h3-9,19H,17H2,1-2H3
Reactome pathway
PCBioAssay
n/an/a 1.06E+4n/an/an/an/an/an/a
The Scripps Research Institute Molecular Screening Center
Curated by PubChem BioAssay
Assay Description
Source (MLSCN Center Name): The Scripps Research Institute Molecular Screening Center Center Affiliation: The Scripps Research Institute, TSRI Assay ...
PubChem Bioassay (2007)
BindingDB Entry DOI: 10.7270/Q2319T8T
Sphingosine 1-phosphate receptor 1
(Homo sapiens (Human))
BDBM37278
((6E)-4-amino-6-(5-isopropyl-3H-1,3-benzoxazol-2-yl...)
Show SMILES CC(C)c1ccc2oc(nc2c1)-c1cc(N)ccc1O
Show InChI InChI=1S/C16H16N2O2/c1-9(2)10-3-6-15-13(7-10)18-16(20-15)12-8-11(17)4-5-14(12)19/h3-9,19H,17H2,1-2H3
Reactome pathway
PCBioAssay
n/an/an/an/a 9.37E+3n/an/an/an/a
The Scripps Research Institute Molecular Screening Center
Curated by PubChem BioAssay
Assay Description
Source (MLSCN Center Name): The Scripps Research Institute Molecular Screening Center Center Affiliation: The Scripps Research Institute, TSRI Assay ...
PubChem Bioassay (2007)
BindingDB Entry DOI: 10.7270/Q2251GJ9