null
SMILES: Fc1ccc(CCn2cnc(c2)-c2cc(ccn2)-c2nn[nH]c2C(F)(F)F)cc1
InChI Key: InChIKey=JIJUDABPAABLQY-UHFFFAOYSA-N
Activity Spreadsheet -- Enzyme Inhibition Constant Data from BindingDB
Found 4 hits for monomerid = 373163
Trg + Lig
Ki
nM
ΔG°
kcal/mole
IC50
nM
Kd
nM
EC50/IC50
nM
koff
s-1
kon
M-1s-1
pHTemp
°C
Lysine-specific demethylase 2B
(Homo sapiens (Human))
BDBM373163
(2-{1-[2-(4-fluorophenyl)ethyl]-1H-imidazol- 4-yl}-...)
Show SMILES Fc1ccc(CCn2cnc(c2)-c2cc(ccn2)-c2nn[nH]c2C(F)(F)F)cc1
Show InChI InChI=1S/C19H14F4N6/c20-14-3-1-12(2-4-14)6-8-29-10-16(25-11-29)15-9-13(5-7-24-15)17-18(19(21,22)23)27-28-26-17/h1-5,7,9-11H,6,8H2,(H,26,27,28)
US Patent
n/an/a<100n/an/an/an/an/an/a
GSK
Assay Description
The ability of test compounds to inhibit the activity of FBXL10 was determined in 384-well plate format under the following reaction conditions: 0.3 ...
Bioorg Med Chem Lett 17: 1584-9 (2007)
BindingDB Entry DOI: 10.7270/Q2FT8PBQ
Lysine-specific demethylase 6B
(Homo sapiens (Human))
BDBM373163
(2-{1-[2-(4-fluorophenyl)ethyl]-1H-imidazol- 4-yl}-...)
Show SMILES Fc1ccc(CCn2cnc(c2)-c2cc(ccn2)-c2nn[nH]c2C(F)(F)F)cc1
Show InChI InChI=1S/C19H14F4N6/c20-14-3-1-12(2-4-14)6-8-29-10-16(25-11-29)15-9-13(5-7-24-15)17-18(19(21,22)23)27-28-26-17/h1-5,7,9-11H,6,8H2,(H,26,27,28)
US Patent
n/an/a>500n/an/an/an/an/an/a
GSK
Assay Description
The ability of test compounds to inhibit the activity of JMJD3 was determined in 384-well plate format under the following reaction conditions: 1 nM ...
Bioorg Med Chem Lett 17: 1584-9 (2007)
BindingDB Entry DOI: 10.7270/Q2FT8PBQ
Lysine-specific demethylase 4C
(Homo sapiens (Human))
BDBM373163
(2-{1-[2-(4-fluorophenyl)ethyl]-1H-imidazol- 4-yl}-...)
Show SMILES Fc1ccc(CCn2cnc(c2)-c2cc(ccn2)-c2nn[nH]c2C(F)(F)F)cc1
Show InChI InChI=1S/C19H14F4N6/c20-14-3-1-12(2-4-14)6-8-29-10-16(25-11-29)15-9-13(5-7-24-15)17-18(19(21,22)23)27-28-26-17/h1-5,7,9-11H,6,8H2,(H,26,27,28)
US Patent
n/an/a>1.00E+4n/an/an/an/an/an/a
GSK
Assay Description
The ability of test compounds to inhibit the activity of JMJD2C was determined in 384-well plate format under the following reaction conditions: 0.3 ...
Bioorg Med Chem Lett 17: 1584-9 (2007)
BindingDB Entry DOI: 10.7270/Q2FT8PBQ
Lysine-specific demethylase 5B
(Homo sapiens (Human))
BDBM373163
(2-{1-[2-(4-fluorophenyl)ethyl]-1H-imidazol- 4-yl}-...)
Show SMILES Fc1ccc(CCn2cnc(c2)-c2cc(ccn2)-c2nn[nH]c2C(F)(F)F)cc1
Show InChI InChI=1S/C19H14F4N6/c20-14-3-1-12(2-4-14)6-8-29-10-16(25-11-29)15-9-13(5-7-24-15)17-18(19(21,22)23)27-28-26-17/h1-5,7,9-11H,6,8H2,(H,26,27,28)
US Patent
n/an/a<100n/an/an/an/an/an/a
GSK
Assay Description
The ability of test compounds to inhibit the activity of Jarid1B was determined in 384-well plate format under the following reaction conditions: 0.8...
Bioorg Med Chem Lett 17: 1584-9 (2007)
BindingDB Entry DOI: 10.7270/Q2FT8PBQ