BDBM373815 3-chloro-4-(1-((6-methylpyridin-2-yl)methyl)piperidin-4-yloxy)-N-(thiazol-2-yl)benzenesulfonamide::US10246453, Example 82::US10662184, Example 82::US10815229, Example 82
SMILES: Cc1cccc(CN2CCC(CC2)Oc2ccc(cc2Cl)S(=O)(=O)Nc2nccs2)n1
InChI Key: InChIKey=CGHBGTPLSVOVBS-UHFFFAOYSA-N
Data: 12 IC50
Activity Spreadsheet -- Enzyme Inhibition Constant Data from BindingDB
Found 12 hits for monomerid = 373815
Trg + Lig
Ki
nM
ΔG°
kcal/mole
IC50
nM
Kd
nM
EC50/IC50
nM
koff
s-1
kon
M-1s-1
pHTemp
°C
Sodium channel protein type 8 subunit alpha
(Homo sapiens (Human))
BDBM373815
(3-chloro-4-(1-((6-methylpyridin-2-yl)methyl)piperi...)
Show SMILES Cc1cccc(CN2CCC(CC2)Oc2ccc(cc2Cl)S(=O)(=O)Nc2nccs2)n1
Show InChI InChI=1S/C21H23ClN4O3S2/c1-15-3-2-4-16(24-15)14-26-10-7-17(8-11-26)29-20-6-5-18(13-19(20)22)31(27,28)25-21-23-9-12-30-21/h2-6,9,12-13,17H,7-8,10-11,14H2,1H3,(H,23,25)
Reactome pathway
US Patent
n/an/a 423n/an/an/an/an/an/a
St. Jude Research Hospital
Assay Description
This sodium influx assay employs the use of the cell permeable, sodium sensitive dye ANG2 to quantify sodium ion influx through sodium channels which...
J Med Chem 50: 1876-85 (2007)
BindingDB Entry DOI: 10.7270/Q2HM5BRC
Sodium channel protein type 5 subunit alpha
(Homo sapiens (Human))
BDBM373815
(3-chloro-4-(1-((6-methylpyridin-2-yl)methyl)piperi...)
Show SMILES Cc1cccc(CN2CCC(CC2)Oc2ccc(cc2Cl)S(=O)(=O)Nc2nccs2)n1
Show InChI InChI=1S/C21H23ClN4O3S2/c1-15-3-2-4-16(24-15)14-26-10-7-17(8-11-26)29-20-6-5-18(13-19(20)22)31(27,28)25-21-23-9-12-30-21/h2-6,9,12-13,17H,7-8,10-11,14H2,1H3,(H,23,25)
US Patent
n/an/a>3.00E+4n/an/an/an/an/an/a
St. Jude Research Hospital
Assay Description
This sodium influx assay employs the use of the cell permeable, sodium sensitive dye ANG2 to quantify sodium ion influx through sodium channels which...
J Med Chem 50: 1876-85 (2007)
BindingDB Entry DOI: 10.7270/Q2HM5BRC
Sodium channel alpha subunit
(Homo sapiens (Human))
BDBM373815
(3-chloro-4-(1-((6-methylpyridin-2-yl)methyl)piperi...)
Show SMILES Cc1cccc(CN2CCC(CC2)Oc2ccc(cc2Cl)S(=O)(=O)Nc2nccs2)n1
Show InChI InChI=1S/C21H23ClN4O3S2/c1-15-3-2-4-16(24-15)14-26-10-7-17(8-11-26)29-20-6-5-18(13-19(20)22)31(27,28)25-21-23-9-12-30-21/h2-6,9,12-13,17H,7-8,10-11,14H2,1H3,(H,23,25)
US Patent
n/an/a>3.00E+4n/an/an/an/an/an/a
St. Jude Research Hospital
Assay Description
This sodium influx assay employs the use of the cell permeable, sodium sensitive dye ANG2 to quantify sodium ion influx through sodium channels which...
J Med Chem 50: 1876-85 (2007)
BindingDB Entry DOI: 10.7270/Q2HM5BRC
Sodium channel protein type 8 subunit alpha
(Homo sapiens (Human))
BDBM373815
(3-chloro-4-(1-((6-methylpyridin-2-yl)methyl)piperi...)
Show SMILES Cc1cccc(CN2CCC(CC2)Oc2ccc(cc2Cl)S(=O)(=O)Nc2nccs2)n1
Show InChI InChI=1S/C21H23ClN4O3S2/c1-15-3-2-4-16(24-15)14-26-10-7-17(8-11-26)29-20-6-5-18(13-19(20)22)31(27,28)25-21-23-9-12-30-21/h2-6,9,12-13,17H,7-8,10-11,14H2,1H3,(H,23,25)
Reactome pathway
US Patent
n/an/a 56n/an/an/an/an/an/a
St. Jude Research Hospital
Assay Description
Patch voltage clamp electrophysiology allows for the direct measurement and quantification of block of voltage-gated sodium channels (Nay's), and...
J Med Chem 50: 1876-85 (2007)
BindingDB Entry DOI: 10.7270/Q2HM5BRC
Sodium channel alpha subunit
(Homo sapiens (Human))
BDBM373815
(3-chloro-4-(1-((6-methylpyridin-2-yl)methyl)piperi...)
Show SMILES Cc1cccc(CN2CCC(CC2)Oc2ccc(cc2Cl)S(=O)(=O)Nc2nccs2)n1
Show InChI InChI=1S/C21H23ClN4O3S2/c1-15-3-2-4-16(24-15)14-26-10-7-17(8-11-26)29-20-6-5-18(13-19(20)22)31(27,28)25-21-23-9-12-30-21/h2-6,9,12-13,17H,7-8,10-11,14H2,1H3,(H,23,25)
US Patent
n/an/a>1.00E+4n/an/an/an/an/an/a
St. Jude Research Hospital
Assay Description
Patch voltage clamp electrophysiology allows for the direct measurement and quantification of block of voltage-gated sodium channels (Nay's), and...
J Med Chem 50: 1876-85 (2007)
BindingDB Entry DOI: 10.7270/Q2HM5BRC
Sodium channel alpha subunit
(Homo sapiens (Human))
BDBM373815
(3-chloro-4-(1-((6-methylpyridin-2-yl)methyl)piperi...)
Show SMILES Cc1cccc(CN2CCC(CC2)Oc2ccc(cc2Cl)S(=O)(=O)Nc2nccs2)n1
Show InChI InChI=1S/C21H23ClN4O3S2/c1-15-3-2-4-16(24-15)14-26-10-7-17(8-11-26)29-20-6-5-18(13-19(20)22)31(27,28)25-21-23-9-12-30-21/h2-6,9,12-13,17H,7-8,10-11,14H2,1H3,(H,23,25)
US Patent
n/an/a>1.00E+4n/an/an/an/an/an/a
Xenon Pharmaceuticals Inc.
US Patent
Assay Description
Patch voltage clamp electrophysiology allows for the direct measurement and quantification of block of voltage-gated sodium channels (Nay's), and...
US Patent US10815229 (2020)
Sodium channel alpha subunit
(Homo sapiens (Human))
BDBM373815
(3-chloro-4-(1-((6-methylpyridin-2-yl)methyl)piperi...)
Show SMILES Cc1cccc(CN2CCC(CC2)Oc2ccc(cc2Cl)S(=O)(=O)Nc2nccs2)n1
Show InChI InChI=1S/C21H23ClN4O3S2/c1-15-3-2-4-16(24-15)14-26-10-7-17(8-11-26)29-20-6-5-18(13-19(20)22)31(27,28)25-21-23-9-12-30-21/h2-6,9,12-13,17H,7-8,10-11,14H2,1H3,(H,23,25)
US Patent
n/an/a>1.00E+4n/an/an/an/an/an/a
Xenon Pharmaceuticals Inc.
US Patent
Assay Description
The following patch voltage clamp electrophysiology studies were performed on representative compounds of the invention using human embryonic kidney ...
US Patent US10662184 (2020)
Sodium channel protein type 8 subunit alpha
(Homo sapiens (Human))
BDBM373815
(3-chloro-4-(1-((6-methylpyridin-2-yl)methyl)piperi...)
Show SMILES Cc1cccc(CN2CCC(CC2)Oc2ccc(cc2Cl)S(=O)(=O)Nc2nccs2)n1
Show InChI InChI=1S/C21H23ClN4O3S2/c1-15-3-2-4-16(24-15)14-26-10-7-17(8-11-26)29-20-6-5-18(13-19(20)22)31(27,28)25-21-23-9-12-30-21/h2-6,9,12-13,17H,7-8,10-11,14H2,1H3,(H,23,25)
Reactome pathway
US Patent
n/an/a 423n/an/an/an/an/an/a
Xenon Pharmaceuticals Inc.
US Patent
Assay Description
In general, Trex HEK293 cells were stably transfected with an inducible expression vector containing the full-length cDNA coding for the desired huma...
US Patent US10815229 (2020)
Sodium channel protein type 5 subunit alpha
(Homo sapiens (Human))
BDBM373815
(3-chloro-4-(1-((6-methylpyridin-2-yl)methyl)piperi...)
Show SMILES Cc1cccc(CN2CCC(CC2)Oc2ccc(cc2Cl)S(=O)(=O)Nc2nccs2)n1
Show InChI InChI=1S/C21H23ClN4O3S2/c1-15-3-2-4-16(24-15)14-26-10-7-17(8-11-26)29-20-6-5-18(13-19(20)22)31(27,28)25-21-23-9-12-30-21/h2-6,9,12-13,17H,7-8,10-11,14H2,1H3,(H,23,25)
US Patent
n/an/a>3.00E+4n/an/an/an/an/an/a
Xenon Pharmaceuticals Inc.
US Patent
Assay Description
In general, Trex HEK293 cells were stably transfected with an inducible expression vector containing the full-length cDNA coding for the desired huma...
US Patent US10815229 (2020)
Sodium channel alpha subunit
(Homo sapiens (Human))
BDBM373815
(3-chloro-4-(1-((6-methylpyridin-2-yl)methyl)piperi...)
Show SMILES Cc1cccc(CN2CCC(CC2)Oc2ccc(cc2Cl)S(=O)(=O)Nc2nccs2)n1
Show InChI InChI=1S/C21H23ClN4O3S2/c1-15-3-2-4-16(24-15)14-26-10-7-17(8-11-26)29-20-6-5-18(13-19(20)22)31(27,28)25-21-23-9-12-30-21/h2-6,9,12-13,17H,7-8,10-11,14H2,1H3,(H,23,25)
US Patent
n/an/a>3.00E+4n/an/an/an/an/an/a
Xenon Pharmaceuticals Inc.
US Patent
Assay Description
In general, Trex HEK293 cells were stably transfected with an inducible expression vector containing the full-length cDNA coding for the desired huma...
US Patent US10815229 (2020)
ep nav1.6
(Homo sapiens (Human))
BDBM373815
(3-chloro-4-(1-((6-methylpyridin-2-yl)methyl)piperi...)
Show SMILES Cc1cccc(CN2CCC(CC2)Oc2ccc(cc2Cl)S(=O)(=O)Nc2nccs2)n1
Show InChI InChI=1S/C21H23ClN4O3S2/c1-15-3-2-4-16(24-15)14-26-10-7-17(8-11-26)29-20-6-5-18(13-19(20)22)31(27,28)25-21-23-9-12-30-21/h2-6,9,12-13,17H,7-8,10-11,14H2,1H3,(H,23,25)
Reactome pathway
US Patent
n/an/a 56n/an/an/an/an/an/a
Xenon Pharmaceuticals Inc.
US Patent
Assay Description
Patch voltage clamp electrophysiology allows for the direct measurement and quantification of block of voltage-gated sodium channels (Nay's), and...
US Patent US10815229 (2020)
Sodium channel protein type 8 alpha subunit
(Homo sapiens (Human))
BDBM373815
(3-chloro-4-(1-((6-methylpyridin-2-yl)methyl)piperi...)
Show SMILES Cc1cccc(CN2CCC(CC2)Oc2ccc(cc2Cl)S(=O)(=O)Nc2nccs2)n1
Show InChI InChI=1S/C21H23ClN4O3S2/c1-15-3-2-4-16(24-15)14-26-10-7-17(8-11-26)29-20-6-5-18(13-19(20)22)31(27,28)25-21-23-9-12-30-21/h2-6,9,12-13,17H,7-8,10-11,14H2,1H3,(H,23,25)
Reactome pathway
US Patent
n/an/a 56n/an/an/an/an/an/a
Xenon Pharmaceuticals Inc.
US Patent
Assay Description
The following patch voltage clamp electrophysiology studies were performed on representative compounds of the invention using human embryonic kidney ...
US Patent US10662184 (2020)