BDBM373836 (S)-4-((1-benzylpyrrolidin-3-yl)(methyl)amino)-2,6-difluoro-3-methyl-N-(thiazol-4-yl)benzenesulfonamide 2,2,2-trifluoroacetate::US10246453, Example 103::US10662184, Example 103
SMILES: CN(C1CCN(Cc2ccccc2)C1)c1cc(F)c(c(F)c1C)S(=O)(=O)Nc1cscn1
InChI Key: InChIKey=HNOCOLAFLBICIU-UHFFFAOYSA-N
Data: 9 IC50
Activity Spreadsheet -- Enzyme Inhibition Constant Data from BindingDB
Found 9 hits for monomerid = 373836
Trg + Lig
Ki
nM
ΔG°
kcal/mole
IC50
nM
Kd
nM
EC50/IC50
nM
koff
s-1
kon
M-1s-1
pHTemp
°C
Sodium channel protein type 8 subunit alpha
(Homo sapiens (Human))
BDBM373836
((S)-4-((1-benzylpyrrolidin-3-yl)(methyl)amino)-2,6...)
Show SMILES CN(C1CCN(Cc2ccccc2)C1)c1cc(F)c(c(F)c1C)S(=O)(=O)Nc1cscn1
Show InChI InChI=1S/C22H24F2N4O2S2/c1-15-19(27(2)17-8-9-28(12-17)11-16-6-4-3-5-7-16)10-18(23)22(21(15)24)32(29,30)26-20-13-31-14-25-20/h3-7,10,13-14,17,26H,8-9,11-12H2,1-2H3
Reactome pathway
US Patent
n/an/a 61n/an/an/an/an/an/a
St. Jude Research Hospital
Assay Description
This sodium influx assay employs the use of the cell permeable, sodium sensitive dye ANG2 to quantify sodium ion influx through sodium channels which...
J Med Chem 50: 1876-85 (2007)
BindingDB Entry DOI: 10.7270/Q2HM5BRC
Sodium channel protein type 5 subunit alpha
(Homo sapiens (Human))
BDBM373836
((S)-4-((1-benzylpyrrolidin-3-yl)(methyl)amino)-2,6...)
Show SMILES CN(C1CCN(Cc2ccccc2)C1)c1cc(F)c(c(F)c1C)S(=O)(=O)Nc1cscn1
Show InChI InChI=1S/C22H24F2N4O2S2/c1-15-19(27(2)17-8-9-28(12-17)11-16-6-4-3-5-7-16)10-18(23)22(21(15)24)32(29,30)26-20-13-31-14-25-20/h3-7,10,13-14,17,26H,8-9,11-12H2,1-2H3
US Patent
n/an/a 2.82E+4n/an/an/an/an/an/a
St. Jude Research Hospital
Assay Description
This sodium influx assay employs the use of the cell permeable, sodium sensitive dye ANG2 to quantify sodium ion influx through sodium channels which...
J Med Chem 50: 1876-85 (2007)
BindingDB Entry DOI: 10.7270/Q2HM5BRC
Sodium channel alpha subunit
(Homo sapiens (Human))
BDBM373836
((S)-4-((1-benzylpyrrolidin-3-yl)(methyl)amino)-2,6...)
Show SMILES CN(C1CCN(Cc2ccccc2)C1)c1cc(F)c(c(F)c1C)S(=O)(=O)Nc1cscn1
Show InChI InChI=1S/C22H24F2N4O2S2/c1-15-19(27(2)17-8-9-28(12-17)11-16-6-4-3-5-7-16)10-18(23)22(21(15)24)32(29,30)26-20-13-31-14-25-20/h3-7,10,13-14,17,26H,8-9,11-12H2,1-2H3
US Patent
n/an/a 2.85E+4n/an/an/an/an/an/a
St. Jude Research Hospital
Assay Description
This sodium influx assay employs the use of the cell permeable, sodium sensitive dye ANG2 to quantify sodium ion influx through sodium channels which...
J Med Chem 50: 1876-85 (2007)
BindingDB Entry DOI: 10.7270/Q2HM5BRC
Sodium channel protein type 8 subunit alpha
(Homo sapiens (Human))
BDBM373836
((S)-4-((1-benzylpyrrolidin-3-yl)(methyl)amino)-2,6...)
Show SMILES CN(C1CCN(Cc2ccccc2)C1)c1cc(F)c(c(F)c1C)S(=O)(=O)Nc1cscn1
Show InChI InChI=1S/C22H24F2N4O2S2/c1-15-19(27(2)17-8-9-28(12-17)11-16-6-4-3-5-7-16)10-18(23)22(21(15)24)32(29,30)26-20-13-31-14-25-20/h3-7,10,13-14,17,26H,8-9,11-12H2,1-2H3
Reactome pathway
US Patent
n/an/a 17n/an/an/an/an/an/a
St. Jude Research Hospital
Assay Description
Patch voltage clamp electrophysiology allows for the direct measurement and quantification of block of voltage-gated sodium channels (Nay's), and...
J Med Chem 50: 1876-85 (2007)
BindingDB Entry DOI: 10.7270/Q2HM5BRC
Sodium channel alpha subunit
(Homo sapiens (Human))
BDBM373836
((S)-4-((1-benzylpyrrolidin-3-yl)(methyl)amino)-2,6...)
Show SMILES CN(C1CCN(Cc2ccccc2)C1)c1cc(F)c(c(F)c1C)S(=O)(=O)Nc1cscn1
Show InChI InChI=1S/C22H24F2N4O2S2/c1-15-19(27(2)17-8-9-28(12-17)11-16-6-4-3-5-7-16)10-18(23)22(21(15)24)32(29,30)26-20-13-31-14-25-20/h3-7,10,13-14,17,26H,8-9,11-12H2,1-2H3
US Patent
n/an/a 4.09E+4n/an/an/an/an/an/a
Xenon Pharmaceuticals Inc.
US Patent
Assay Description
The following patch voltage clamp electrophysiology studies were performed on representative compounds of the invention using human embryonic kidney ...
US Patent US10662184 (2020)
Sodium channel alpha subunit
(Homo sapiens (Human))
BDBM373836
((S)-4-((1-benzylpyrrolidin-3-yl)(methyl)amino)-2,6...)
Show SMILES CN(C1CCN(Cc2ccccc2)C1)c1cc(F)c(c(F)c1C)S(=O)(=O)Nc1cscn1
Show InChI InChI=1S/C22H24F2N4O2S2/c1-15-19(27(2)17-8-9-28(12-17)11-16-6-4-3-5-7-16)10-18(23)22(21(15)24)32(29,30)26-20-13-31-14-25-20/h3-7,10,13-14,17,26H,8-9,11-12H2,1-2H3
US Patent
n/an/a 4.09E+4n/an/an/an/an/an/a
St. Jude Research Hospital
Assay Description
Patch voltage clamp electrophysiology allows for the direct measurement and quantification of block of voltage-gated sodium channels (Nay's), and...
J Med Chem 50: 1876-85 (2007)
BindingDB Entry DOI: 10.7270/Q2HM5BRC
Sodium channel protein type 8 alpha subunit
(Homo sapiens (Human))
BDBM373836
((S)-4-((1-benzylpyrrolidin-3-yl)(methyl)amino)-2,6...)
Show SMILES CN(C1CCN(Cc2ccccc2)C1)c1cc(F)c(c(F)c1C)S(=O)(=O)Nc1cscn1
Show InChI InChI=1S/C22H24F2N4O2S2/c1-15-19(27(2)17-8-9-28(12-17)11-16-6-4-3-5-7-16)10-18(23)22(21(15)24)32(29,30)26-20-13-31-14-25-20/h3-7,10,13-14,17,26H,8-9,11-12H2,1-2H3
Reactome pathway
US Patent
n/an/a 17n/an/an/an/an/an/a
Xenon Pharmaceuticals Inc.
US Patent
Assay Description
The following patch voltage clamp electrophysiology studies were performed on representative compounds of the invention using human embryonic kidney ...
US Patent US10662184 (2020)
Sodium channel protein type 5 subunit alpha
(Homo sapiens (Human))
BDBM373836
((S)-4-((1-benzylpyrrolidin-3-yl)(methyl)amino)-2,6...)
Show SMILES CN(C1CCN(Cc2ccccc2)C1)c1cc(F)c(c(F)c1C)S(=O)(=O)Nc1cscn1
Show InChI InChI=1S/C22H24F2N4O2S2/c1-15-19(27(2)17-8-9-28(12-17)11-16-6-4-3-5-7-16)10-18(23)22(21(15)24)32(29,30)26-20-13-31-14-25-20/h3-7,10,13-14,17,26H,8-9,11-12H2,1-2H3
US Patent
n/an/a>1.00E+4n/an/an/an/an/an/a
Xenon Pharmaceuticals Inc.
US Patent
Assay Description
The following patch voltage clamp electrophysiology studies were performed on representative compounds of the invention using human embryonic kidney ...
US Patent US10662184 (2020)
Sodium channel protein type 5 subunit alpha
(Homo sapiens (Human))
BDBM373836
((S)-4-((1-benzylpyrrolidin-3-yl)(methyl)amino)-2,6...)
Show SMILES CN(C1CCN(Cc2ccccc2)C1)c1cc(F)c(c(F)c1C)S(=O)(=O)Nc1cscn1
Show InChI InChI=1S/C22H24F2N4O2S2/c1-15-19(27(2)17-8-9-28(12-17)11-16-6-4-3-5-7-16)10-18(23)22(21(15)24)32(29,30)26-20-13-31-14-25-20/h3-7,10,13-14,17,26H,8-9,11-12H2,1-2H3
US Patent
n/an/a>1.00E+4n/an/an/an/an/an/a
St. Jude Research Hospital
Assay Description
Patch voltage clamp electrophysiology allows for the direct measurement and quantification of block of voltage-gated sodium channels (Nay's), and...
J Med Chem 50: 1876-85 (2007)
BindingDB Entry DOI: 10.7270/Q2HM5BRC