BDBM378445 N-((1R,3r,5S)-8-((4-aminopiperidin-1-yl)sulfonyl)-8-azabicyclo[3.2.1]octan-3-yl)-2-oxoindoline-5-carboxamide::US10266526, Compound 578
SMILES: NC1CCN(CC1)S(=O)(=O)N1[C@H]2CC[C@@H]1C[C@@H](C2)NC(=O)c1ccc2NC(=O)Cc2c1
InChI Key: InChIKey=QBSCLRZWNSVWEA-BCDXTJNWSA-N
Data: 3 IC50
Activity Spreadsheet -- Enzyme Inhibition Constant Data from BindingDB
Found 3 hits for monomerid = 378445
Trg + Lig
Ki
nM
ΔG°
kcal/mole
IC50
nM
Kd
nM
EC50/IC50
nM
koff
s-1
kon
M-1s-1
pHTemp
°C
Histone-lysine N-methyltransferase SMYD3
(Homo sapiens (Human))
BDBM378445
(N-((1R,3r,5S)-8-((4-aminopiperidin-1-yl)sulfonyl)-...)
Show SMILES NC1CCN(CC1)S(=O)(=O)N1[C@H]2CC[C@@H]1C[C@@H](C2)NC(=O)c1ccc2NC(=O)Cc2c1 |r,TLB:7:10:13.12:17.16.15|
Show InChI InChI=1S/C21H29N5O4S/c22-15-5-7-25(8-6-15)31(29,30)26-17-2-3-18(26)12-16(11-17)23-21(28)13-1-4-19-14(9-13)10-20(27)24-19/h1,4,9,15-18H,2-3,5-8,10-12,22H2,(H,23,28)(H,24,27)/t16-,17+,18-
US Patent
n/an/a 0.680n/an/an/an/an/an/a
ENSCMu
Assay Description
The assays were all performed in a buffer consisting of 25 mM Tris-Cl pH 8.0, 1 mM TCEP, 0.005% BSG, and 0.005% Tween 20, prepared on the day of use....
Bioorg Med Chem 14: 7241-57 (2006)
BindingDB Entry DOI: 10.7270/Q2DJ5HX2
Histone-lysine N-methyltransferase SMYD3
(Homo sapiens (Human))
BDBM378445
(N-((1R,3r,5S)-8-((4-aminopiperidin-1-yl)sulfonyl)-...)
Show SMILES NC1CCN(CC1)S(=O)(=O)N1[C@H]2CC[C@@H]1C[C@@H](C2)NC(=O)c1ccc2NC(=O)Cc2c1 |r,TLB:7:10:13.12:17.16.15|
Show InChI InChI=1S/C21H29N5O4S/c22-15-5-7-25(8-6-15)31(29,30)26-17-2-3-18(26)12-16(11-17)23-21(28)13-1-4-19-14(9-13)10-20(27)24-19/h1,4,9,15-18H,2-3,5-8,10-12,22H2,(H,23,28)(H,24,27)/t16-,17+,18-
n/an/a 1n/an/an/an/an/an/a
Epizyme Inc.
Curated by ChEMBL
Assay Description
Inhibition of full length N-terminal His-tagged SMYD3 (1 to 428 residues) (unknown origin) expressed in Escherichia coli using N-terminal GST-tagged ...
ACS Med Chem Lett 7: 134-8 (2016)
Article DOI: 10.1021/acsmedchemlett.5b00272
BindingDB Entry DOI: 10.7270/Q2NG4TPR
Histone-lysine N-methyltransferase SMYD3
(Homo sapiens (Human))
BDBM378445
(N-((1R,3r,5S)-8-((4-aminopiperidin-1-yl)sulfonyl)-...)
Show SMILES NC1CCN(CC1)S(=O)(=O)N1[C@H]2CC[C@@H]1C[C@@H](C2)NC(=O)c1ccc2NC(=O)Cc2c1 |r,TLB:7:10:13.12:17.16.15|
Show InChI InChI=1S/C21H29N5O4S/c22-15-5-7-25(8-6-15)31(29,30)26-17-2-3-18(26)12-16(11-17)23-21(28)13-1-4-19-14(9-13)10-20(27)24-19/h1,4,9,15-18H,2-3,5-8,10-12,22H2,(H,23,28)(H,24,27)/t16-,17+,18-
n/an/a 850n/an/an/an/an/an/a
Epizyme Inc.
Curated by ChEMBL
Assay Description
Inhibition of human SMYD3 expressed in HEK293T/17 cells using FLAG-tagged MEKK2 as substrate incubated for 30 mins in low air flow area followed by i...
ACS Med Chem Lett 7: 134-8 (2016)
Article DOI: 10.1021/acsmedchemlett.5b00272
BindingDB Entry DOI: 10.7270/Q2NG4TPR