null
SMILES: CCOc1cc(F)c(Cn2nc(-c3ncc(O)c(Nc4ccncc4)n3)c3ccccc23)c(F)c1
InChI Key: InChIKey=XULWVADMVGBPJU-UHFFFAOYSA-N
Activity Spreadsheet -- Enzyme Inhibition Constant Data from BindingDB
Found 1 hit for monomerid = 378991
Trg + Lig
Ki
nM
ΔG°
kcal/mole
IC50
nM
Kd
nM
EC50/IC50
nM
koff
s-1
kon
M-1s-1
pHTemp
°C
Mitotic checkpoint serine/threonine-protein kinase BUB1
(Homo sapiens (Human))
BDBM378991
(Preparation of 2-[1-(4-ethoxy-2,6-difluorobenzyl)-...)
Show SMILES CCOc1cc(F)c(Cn2nc(-c3ncc(O)c(Nc4ccncc4)n3)c3ccccc23)c(F)c1
Show InChI InChI=1S/C25H20F2N6O2/c1-2-35-16-11-19(26)18(20(27)12-16)14-33-21-6-4-3-5-17(21)23(32-33)25-29-13-22(34)24(31-25)30-15-7-9-28-10-8-15/h3-13,34H,2,14H2,1H3,(H,28,29,30,31)
Reactome pathway
US Patent
n/an/a 4.70n/an/an/an/an/an/a
Johnson & Johnson Pharmaceutical
Assay Description
Bub1-inhibitory activities of compounds described in the present invention were quantified using a time-resolved fluorescence energy transfer (TR-FRE...
J Med Chem 51: 4150-69 (2008)
BindingDB Entry DOI: 10.7270/Q2RV0R1M