BDBM3814 1-Phenylbenzimidazole deriv. 31::3-(1H-1,3-benzodiazol-1-yl)benzamide
SMILES: NC(=O)c1cccc(c1)-n1cnc2ccccc12
InChI Key: InChIKey=XUYVBXZVCTUERS-UHFFFAOYSA-N
Data: 2 IC50
Activity Spreadsheet -- Enzyme Inhibition Constant Data from BindingDB
Found 2 hits for monomerid = 3814
Trg + Lig
Ki
nM
ΔG°
kcal/mole
IC50
nM
Kd
nM
EC50/IC50
nM
koff
s-1
kon
M-1s-1
pHTemp
°C
Fibroblast growth factor receptor 1
(Homo sapiens (Human))
BDBM3814
(1-Phenylbenzimidazole deriv. 31 | 3-(1H-1,3-benzod...)
Show SMILES NC(=O)c1cccc(c1)-n1cnc2ccccc12
Show InChI InChI=1S/C14H11N3O/c15-14(18)10-4-3-5-11(8-10)17-9-16-12-6-1-2-7-13(12)17/h1-9H,(H2,15,18)
NCI pathway
Reactome pathway
n/an/a>5.00E+4n/an/an/an/an/an/a
University of Auckland
Assay Description
IC50 is the inhibitor concentration which inhibits 50% of kinase activity that catalyzes the transfer of the terminal phosphate from [gamma-32P] labe...
J Med Chem 41: 5457-65 (1998)
Article DOI: 10.1021/jm9804681
BindingDB Entry DOI: 10.7270/Q24T6GJC
Platelet-derived growth factor receptor beta
(Homo sapiens (Human))
BDBM3814
(1-Phenylbenzimidazole deriv. 31 | 3-(1H-1,3-benzod...)
Show SMILES NC(=O)c1cccc(c1)-n1cnc2ccccc12
Show InChI InChI=1S/C14H11N3O/c15-14(18)10-4-3-5-11(8-10)17-9-16-12-6-1-2-7-13(12)17/h1-9H,(H2,15,18)
NCI pathway
Reactome pathway
n/an/a>5.00E+4n/an/an/an/an/an/a
University of Auckland
Assay Description
IC50 is the inhibitor concentration which inhibits 50% of kinase activity that catalyzes the transfer of the terminal phosphate from [gamma-32P] labe...
J Med Chem 41: 5457-65 (1998)
Article DOI: 10.1021/jm9804681
BindingDB Entry DOI: 10.7270/Q24T6GJC