BDBM38236 CHEMBL522269::US10201527, Compound 48::US10736881, Compound 48::US8551988, 38
SMILES: Cn1c(CCc2ccccc2)nc2cc(\C=C\C(=O)NO)ccc12
InChI Key: InChIKey=MNTZTXLUYBQSMI-FMIVXFBMSA-N
Data: 7 IC50
Activity Spreadsheet -- Enzyme Inhibition Constant Data from BindingDB
Found 7 hits for monomerid = 38236
Trg + Lig
Ki
nM
ΔG°
kcal/mole
IC50
nM
Kd
nM
EC50/IC50
nM
koff
s-1
kon
M-1s-1
pHTemp
°C
Histone deacetylase 8
(Homo sapiens (Human))
BDBM38236
(CHEMBL522269 | US10201527, Compound 48 | US1073688...)
Show SMILES Cn1c(CCc2ccccc2)nc2cc(\C=C\C(=O)NO)ccc12
Show InChI InChI=1S/C19H19N3O2/c1-22-17-10-7-15(9-12-19(23)21-24)13-16(17)20-18(22)11-8-14-5-3-2-4-6-14/h2-7,9-10,12-13,24H,8,11H2,1H3,(H,21,23)/b12-9+
NCI pathway
Reactome pathway
US Patent
n/an/a 148n/an/an/an/an/an/a
Mei Pharma, Inc.
US Patent
Assay Description
The assay have been carried out in a 96 well format and the BIOMOL using a fluorescent-based HDAC activity assay.
US Patent US8551988 (2013)
BindingDB Entry DOI: 10.7270/Q2BZ64P8
Histone deacetylase 1
(Homo sapiens (Human))
BDBM38236
(CHEMBL522269 | US10201527, Compound 48 | US1073688...)
Show SMILES Cn1c(CCc2ccccc2)nc2cc(\C=C\C(=O)NO)ccc12
Show InChI InChI=1S/C19H19N3O2/c1-22-17-10-7-15(9-12-19(23)21-24)13-16(17)20-18(22)11-8-14-5-3-2-4-6-14/h2-7,9-10,12-13,24H,8,11H2,1H3,(H,21,23)/b12-9+
NCI pathway
Reactome pathway
US Patent
n/an/a 218n/an/an/an/an/an/a
Mei Pharma, Inc.
US Patent
Assay Description
The assay have been carried out in a 96 well format and the BIOMOL using a fluorescent-based HDAC activity assay.
US Patent US8551988 (2013)
BindingDB Entry DOI: 10.7270/Q2BZ64P8
Histone deacetylase 1
(Homo sapiens (Human))
BDBM38236
(CHEMBL522269 | US10201527, Compound 48 | US1073688...)
Show SMILES Cn1c(CCc2ccccc2)nc2cc(\C=C\C(=O)NO)ccc12
Show InChI InChI=1S/C19H19N3O2/c1-22-17-10-7-15(9-12-19(23)21-24)13-16(17)20-18(22)11-8-14-5-3-2-4-6-14/h2-7,9-10,12-13,24H,8,11H2,1H3,(H,21,23)/b12-9+
NCI pathway
Reactome pathway
n/an/a 260n/an/an/an/an/an/a
S *BIO Pte Ltd
Curated by ChEMBL
Assay Description
Inhibition of recombinant HDAC1 by fluorimetric assay
Bioorg Med Chem Lett 19: 1403-8 (2009)
Article DOI: 10.1016/j.bmcl.2009.01.041
BindingDB Entry DOI: 10.7270/Q2FT8KX3
Histone deacetylase 8
(Homo sapiens (Human))
BDBM38236
(CHEMBL522269 | US10201527, Compound 48 | US1073688...)
Show SMILES Cn1c(CCc2ccccc2)nc2cc(\C=C\C(=O)NO)ccc12
Show InChI InChI=1S/C19H19N3O2/c1-22-17-10-7-15(9-12-19(23)21-24)13-16(17)20-18(22)11-8-14-5-3-2-4-6-14/h2-7,9-10,12-13,24H,8,11H2,1H3,(H,21,23)/b12-9+
NCI pathway
Reactome pathway
US Patent
n/an/a 291n/an/an/an/an/an/a
MEI Pharma, Inc.
US Patent
US Patent US10736881 (2020)
Histone deacetylase 8
(Homo sapiens (Human))
BDBM38236
(CHEMBL522269 | US10201527, Compound 48 | US1073688...)
Show SMILES Cn1c(CCc2ccccc2)nc2cc(\C=C\C(=O)NO)ccc12
Show InChI InChI=1S/C19H19N3O2/c1-22-17-10-7-15(9-12-19(23)21-24)13-16(17)20-18(22)11-8-14-5-3-2-4-6-14/h2-7,9-10,12-13,24H,8,11H2,1H3,(H,21,23)/b12-9+
NCI pathway
Reactome pathway
US Patent
n/an/a 291n/an/an/an/an/an/a
MEI PHARMA, INC.
US Patent
Assay Description
To determine EC50 where acetylated histone 3 was induced by 50%, Colo205 cells was cultivated in 96 well plate at 1.5×105 cells/well for 24 h. Colo20...
US Patent US10201527 (2019)
BindingDB Entry DOI: 10.7270/Q2PK0J7F
Histone deacetylase 1
(Homo sapiens (Human))
BDBM38236
(CHEMBL522269 | US10201527, Compound 48 | US1073688...)
Show SMILES Cn1c(CCc2ccccc2)nc2cc(\C=C\C(=O)NO)ccc12
Show InChI InChI=1S/C19H19N3O2/c1-22-17-10-7-15(9-12-19(23)21-24)13-16(17)20-18(22)11-8-14-5-3-2-4-6-14/h2-7,9-10,12-13,24H,8,11H2,1H3,(H,21,23)/b12-9+
NCI pathway
Reactome pathway
US Patent
n/an/a 356n/an/an/an/an/an/a
MEI Pharma, Inc.
US Patent
Assay Description
The assay has been carried out in 96 well format and the BIOMOL fluorescent-based HDAC activity assay has been applied. The reaction composed of assa...
US Patent US10736881 (2020)
Histone deacetylase 1
(Homo sapiens (Human))
BDBM38236
(CHEMBL522269 | US10201527, Compound 48 | US1073688...)
Show SMILES Cn1c(CCc2ccccc2)nc2cc(\C=C\C(=O)NO)ccc12
Show InChI InChI=1S/C19H19N3O2/c1-22-17-10-7-15(9-12-19(23)21-24)13-16(17)20-18(22)11-8-14-5-3-2-4-6-14/h2-7,9-10,12-13,24H,8,11H2,1H3,(H,21,23)/b12-9+
NCI pathway
Reactome pathway
US Patent
n/an/a 356n/an/an/an/an/an/a
MEI PHARMA, INC.
US Patent
Assay Description
The assay has been carried out in 96 well format and the BIOMOL fluorescent-based HDAC activity assay has been applied. The reaction composed of assa...
US Patent US10201527 (2019)
BindingDB Entry DOI: 10.7270/Q2PK0J7F