BDBM3826 1-Phenylbenzimidazole deriv. 43::methyl 4-(1H-1,3-benzodiazol-1-yl)benzoate
SMILES: COC(=O)c1ccc(cc1)-n1cnc2ccccc12
InChI Key: InChIKey=USTFFLGAYQZTMH-UHFFFAOYSA-N
Data: 2 IC50
Activity Spreadsheet -- Enzyme Inhibition Constant Data from BindingDB
Found 2 hits for monomerid = 3826
Trg + Lig
Ki
nM
ΔG°
kcal/mole
IC50
nM
Kd
nM
EC50/IC50
nM
koff
s-1
kon
M-1s-1
pHTemp
°C
Fibroblast growth factor receptor 1
(Homo sapiens (Human))
BDBM3826
(1-Phenylbenzimidazole deriv. 43 | methyl 4-(1H-1,3...)
Show SMILES COC(=O)c1ccc(cc1)-n1cnc2ccccc12
Show InChI InChI=1S/C15H12N2O2/c1-19-15(18)11-6-8-12(9-7-11)17-10-16-13-4-2-3-5-14(13)17/h2-10H,1H3
NCI pathway
Reactome pathway
n/an/a 5.00E+4n/an/an/an/an/an/a
University of Auckland
Assay Description
IC50 is the inhibitor concentration which inhibits 50% of kinase activity that catalyzes the transfer of the terminal phosphate from [gamma-32P] labe...
J Med Chem 41: 5457-65 (1998)
Article DOI: 10.1021/jm9804681
BindingDB Entry DOI: 10.7270/Q24T6GJC
Platelet-derived growth factor receptor beta
(Homo sapiens (Human))
BDBM3826
(1-Phenylbenzimidazole deriv. 43 | methyl 4-(1H-1,3...)
Show SMILES COC(=O)c1ccc(cc1)-n1cnc2ccccc12
Show InChI InChI=1S/C15H12N2O2/c1-19-15(18)11-6-8-12(9-7-11)17-10-16-13-4-2-3-5-14(13)17/h2-10H,1H3
NCI pathway
Reactome pathway
n/an/a 7.20E+3n/an/an/an/an/an/a
University of Auckland
Assay Description
IC50 is the inhibitor concentration which inhibits 50% of kinase activity that catalyzes the transfer of the terminal phosphate from [gamma-32P] labe...
J Med Chem 41: 5457-65 (1998)
Article DOI: 10.1021/jm9804681
BindingDB Entry DOI: 10.7270/Q24T6GJC