BDBM3830 1-Phenylbenzimidazole deriv. 47::1-[4-(1H-1,3-benzodiazol-1-yl)phenyl]ethan-1-one
SMILES: CC(=O)c1ccc(cc1)-n1cnc2ccccc12
InChI Key: InChIKey=QUJQOWRVTLABIP-UHFFFAOYSA-N
Data: 2 IC50
Activity Spreadsheet -- Enzyme Inhibition Constant Data from BindingDB
Found 2 hits for monomerid = 3830
Trg + Lig
Ki
nM
ΔG°
kcal/mole
IC50
nM
Kd
nM
EC50/IC50
nM
koff
s-1
kon
M-1s-1
pHTemp
°C
Fibroblast growth factor receptor 1
(Homo sapiens (Human))
BDBM3830
(1-Phenylbenzimidazole deriv. 47 | 1-[4-(1H-1,3-ben...)
Show SMILES CC(=O)c1ccc(cc1)-n1cnc2ccccc12
Show InChI InChI=1S/C15H12N2O/c1-11(18)12-6-8-13(9-7-12)17-10-16-14-4-2-3-5-15(14)17/h2-10H,1H3
NCI pathway
Reactome pathway
n/an/a>5.00E+4n/an/an/an/an/an/a
University of Auckland
Assay Description
IC50 is the inhibitor concentration which inhibits 50% of kinase activity that catalyzes the transfer of the terminal phosphate from [gamma-32P] labe...
J Med Chem 41: 5457-65 (1998)
Article DOI: 10.1021/jm9804681
BindingDB Entry DOI: 10.7270/Q24T6GJC
Platelet-derived growth factor receptor beta
(Homo sapiens (Human))
BDBM3830
(1-Phenylbenzimidazole deriv. 47 | 1-[4-(1H-1,3-ben...)
Show SMILES CC(=O)c1ccc(cc1)-n1cnc2ccccc12
Show InChI InChI=1S/C15H12N2O/c1-11(18)12-6-8-13(9-7-12)17-10-16-14-4-2-3-5-15(14)17/h2-10H,1H3
NCI pathway
Reactome pathway
n/an/a 2.40E+4n/an/an/an/an/an/a
University of Auckland
Assay Description
IC50 is the inhibitor concentration which inhibits 50% of kinase activity that catalyzes the transfer of the terminal phosphate from [gamma-32P] labe...
J Med Chem 41: 5457-65 (1998)
Article DOI: 10.1021/jm9804681
BindingDB Entry DOI: 10.7270/Q24T6GJC