null
SMILES: c1nc2ccccc2n1-c1ccncc1
InChI Key: InChIKey=FQOVHYLLSGHMGI-UHFFFAOYSA-N
Activity Spreadsheet -- Enzyme Inhibition Constant Data from BindingDB
Found 2 hits for monomerid = 3833
Trg + Lig
Ki
nM
ΔG°
kcal/mole
IC50
nM
Kd
nM
EC50/IC50
nM
koff
s-1
kon
M-1s-1
pHTemp
°C
Fibroblast growth factor receptor 1
(Homo sapiens (Human))
BDBM3833
(1-(pyridin-4-yl)-1H-1,3-benzodiazole | 1-Phenylben...)
Show SMILES c1nc2ccccc2n1-c1ccncc1
Show InChI InChI=1S/C12H9N3/c1-2-4-12-11(3-1)14-9-15(12)10-5-7-13-8-6-10/h1-9H
NCI pathway
Reactome pathway
n/an/a>5.00E+4n/an/an/an/an/an/a
University of Auckland
Assay Description
IC50 is the inhibitor concentration which inhibits 50% of kinase activity that catalyzes the transfer of the terminal phosphate from [gamma-32P] labe...
J Med Chem 41: 5457-65 (1998)
Article DOI: 10.1021/jm9804681
BindingDB Entry DOI: 10.7270/Q24T6GJC
Platelet-derived growth factor receptor beta
(Homo sapiens (Human))
BDBM3833
(1-(pyridin-4-yl)-1H-1,3-benzodiazole | 1-Phenylben...)
Show SMILES c1nc2ccccc2n1-c1ccncc1
Show InChI InChI=1S/C12H9N3/c1-2-4-12-11(3-1)14-9-15(12)10-5-7-13-8-6-10/h1-9H
NCI pathway
Reactome pathway
n/an/a 1.20E+4n/an/an/an/an/an/a
University of Auckland
Assay Description
IC50 is the inhibitor concentration which inhibits 50% of kinase activity that catalyzes the transfer of the terminal phosphate from [gamma-32P] labe...
J Med Chem 41: 5457-65 (1998)
Article DOI: 10.1021/jm9804681
BindingDB Entry DOI: 10.7270/Q24T6GJC