BDBM3848 1-Phenylbenzimidazole deriv. 65::1-phenyl-1H-1,3-benzodiazol-5-ol::5-Substituted 1-Phenylbenzimidazole 5
SMILES: Oc1ccc2n(cnc2c1)-c1ccccc1
InChI Key: InChIKey=OQAPWZCMAFFBBL-UHFFFAOYSA-N
Data: 5 IC50
Activity Spreadsheet -- Enzyme Inhibition Constant Data from BindingDB
Found 5 hits for monomerid = 3848
Trg + Lig
Ki
nM
ΔG°
kcal/mole
IC50
nM
Kd
nM
EC50/IC50
nM
koff
s-1
kon
M-1s-1
pHTemp
°C
Platelet-derived growth factor receptor beta
(Homo sapiens (Human))
BDBM3848
(1-Phenylbenzimidazole deriv. 65 | 1-phenyl-1H-1,3-...)
Show SMILES Oc1ccc2n(cnc2c1)-c1ccccc1
Show InChI InChI=1S/C13H10N2O/c16-11-6-7-13-12(8-11)14-9-15(13)10-4-2-1-3-5-10/h1-9,16H
NCI pathway
Reactome pathway
n/an/a 440n/an/an/an/an/an/a
University of Auckland
Assay Description
IC50 is the inhibitor concentration which inhibits 50% of kinase activity that catalyzes the transfer of the terminal phosphate from [gamma-32P] labe...
J Med Chem 41: 5457-65 (1998)
Article DOI: 10.1021/jm9804681
BindingDB Entry DOI: 10.7270/Q24T6GJC
Fibroblast growth factor receptor 1
(Homo sapiens (Human))
BDBM3848
(1-Phenylbenzimidazole deriv. 65 | 1-phenyl-1H-1,3-...)
Show SMILES Oc1ccc2n(cnc2c1)-c1ccccc1
Show InChI InChI=1S/C13H10N2O/c16-11-6-7-13-12(8-11)14-9-15(13)10-4-2-1-3-5-10/h1-9,16H
NCI pathway
Reactome pathway
n/an/a 6.40E+3n/an/an/an/an/an/a
University of Auckland
Assay Description
IC50 is the inhibitor concentration which inhibits 50% of kinase activity that catalyzes the transfer of the terminal phosphate from [gamma-32P] labe...
J Med Chem 41: 5457-65 (1998)
Article DOI: 10.1021/jm9804681
BindingDB Entry DOI: 10.7270/Q24T6GJC
Proto-oncogene tyrosine-protein kinase Src
(Homo sapiens (Human))
BDBM3848
(1-Phenylbenzimidazole deriv. 65 | 1-phenyl-1H-1,3-...)
Show SMILES Oc1ccc2n(cnc2c1)-c1ccccc1
Show InChI InChI=1S/C13H10N2O/c16-11-6-7-13-12(8-11)14-9-15(13)10-4-2-1-3-5-10/h1-9,16H
n/an/a>5.00E+4n/an/an/an/an/an/a
University of Auckland
Assay Description
IC50 is the inhibitor concentration which inhibits 50% of kinase activity that catalyzes the transfer of the terminal phosphate from [gamma-32P] labe...
J Med Chem 42: 2373-82 (1999)
Article DOI: 10.1021/jm980658b
BindingDB Entry DOI: 10.7270/Q2W957B2
Fibroblast growth factor receptor 1
(Homo sapiens (Human))
BDBM3848
(1-Phenylbenzimidazole deriv. 65 | 1-phenyl-1H-1,3-...)
Show SMILES Oc1ccc2n(cnc2c1)-c1ccccc1
Show InChI InChI=1S/C13H10N2O/c16-11-6-7-13-12(8-11)14-9-15(13)10-4-2-1-3-5-10/h1-9,16H
NCI pathway
Reactome pathway
n/an/a 6.40E+3n/an/an/an/an/an/a
University of Auckland
Assay Description
IC50 is the inhibitor concentration which inhibits 50% of kinase activity that catalyzes the transfer of the terminal phosphate from [gamma-32P] labe...
J Med Chem 42: 2373-82 (1999)
Article DOI: 10.1021/jm980658b
BindingDB Entry DOI: 10.7270/Q2W957B2
Platelet-derived growth factor receptor beta
(Homo sapiens (Human))
BDBM3848
(1-Phenylbenzimidazole deriv. 65 | 1-phenyl-1H-1,3-...)
Show SMILES Oc1ccc2n(cnc2c1)-c1ccccc1
Show InChI InChI=1S/C13H10N2O/c16-11-6-7-13-12(8-11)14-9-15(13)10-4-2-1-3-5-10/h1-9,16H
NCI pathway
Reactome pathway
n/an/a 440n/an/an/an/a7.425
University of Auckland
Assay Description
IC50 is the inhibitor concentration which inhibits 50% of kinase activity that catalyzes the transfer of the terminal phosphate from [gamma-32P] labe...
J Med Chem 42: 2373-82 (1999)
Article DOI: 10.1021/jm980658b
BindingDB Entry DOI: 10.7270/Q2W957B2