BDBM385053 (2S)-N-[(1S)-1-Cyano-2-(4-{3-[2-(dimethylamino)ethyl]-2-oxo-2,3-dihydro-1,3- benzoxazol-5-yl}pheny)ethyl]-1,4-oxazepane-2-carboxamide::US10287258, Example 13::US10669245, Example 13
SMILES: CN(C)CCn1c2cc(ccc2oc1=O)-c1ccc(C[C@H](NC(=O)[C@@H]2CNCCCO2)C#N)cc1
InChI Key: InChIKey=BVHRFMZXVRJZAF-URXFXBBRSA-N
Data: 2 IC50
Activity Spreadsheet -- Enzyme Inhibition Constant Data from BindingDB
Found 3 hits for monomerid = 385053
Trg + Lig
Ki
nM
ΔG°
kcal/mole
IC50
nM
Kd
nM
EC50/IC50
nM
koff
s-1
kon
M-1s-1
pHTemp
°C
Dipeptidyl peptidase I
(Homo sapiens (Human))
BDBM385053
((2S)-N-[(1S)-1-Cyano-2-(4-{3-[2-(dimethylamino)eth...)
Show SMILES CN(C)CCn1c2cc(ccc2oc1=O)-c1ccc(C[C@H](NC(=O)[C@@H]2CNCCCO2)C#N)cc1
Show InChI InChI=1S/C26H31N5O4/c1-30(2)11-12-31-22-15-20(8-9-23(22)35-26(31)33)19-6-4-18(5-7-19)14-21(16-27)29-25(32)24-17-28-10-3-13-34-24/h4-9,15,21,24,28H,3,10-14,17H2,1-2H3,(H,29,32)/t21-,24-/m0/s1
US Patent
n/an/a 7.24n/an/an/an/an/an/a
Novartis
Assay Description
The activity of DPP1 was determined by measuring the enzymatic release of aminomethyl coumarin (AMC) from the peptide substrate (H-Gly-Arg-AMC), whic...
J Med Chem 51: 7049-52 (2008)
BindingDB Entry DOI: 10.7270/Q2RJ4MTP
Dipeptidyl peptidase I
(Homo sapiens (Human))
BDBM385053
((2S)-N-[(1S)-1-Cyano-2-(4-{3-[2-(dimethylamino)eth...)
Show SMILES CN(C)CCn1c2cc(ccc2oc1=O)-c1ccc(C[C@H](NC(=O)[C@@H]2CNCCCO2)C#N)cc1
Show InChI InChI=1S/C26H31N5O4/c1-30(2)11-12-31-22-15-20(8-9-23(22)35-26(31)33)19-6-4-18(5-7-19)14-21(16-27)29-25(32)24-17-28-10-3-13-34-24/h4-9,15,21,24,28H,3,10-14,17H2,1-2H3,(H,29,32)/t21-,24-/m0/s1
n/an/a 7.24n/an/an/an/an/an/a
TBA
Citation and Details
Dipeptidyl peptidase I
(Homo sapiens (Human))
BDBM385053
((2S)-N-[(1S)-1-Cyano-2-(4-{3-[2-(dimethylamino)eth...)
Show SMILES CN(C)CCn1c2cc(ccc2oc1=O)-c1ccc(C[C@H](NC(=O)[C@@H]2CNCCCO2)C#N)cc1
Show InChI InChI=1S/C26H31N5O4/c1-30(2)11-12-31-22-15-20(8-9-23(22)35-26(31)33)19-6-4-18(5-7-19)14-21(16-27)29-25(32)24-17-28-10-3-13-34-24/h4-9,15,21,24,28H,3,10-14,17H2,1-2H3,(H,29,32)/t21-,24-/m0/s1
US Patent
n/an/a 7.24n/an/an/an/an/an/a
ASTRAZENECA AB
US Patent
Assay Description
The activity of DPP1 was determined by measuring the enzymatic release of aminomethyl coumarin (AMC) from the peptide substrate (H-Gly-Arg-AMC), whic...
US Patent US10669245 (2020)