null
SMILES: Cc1ccc(cc1)C(=O)COC(=O)CNC(=O)c1ccco1
InChI Key: InChIKey=LJESWLSGGLPOFT-UHFFFAOYSA-N
Activity Spreadsheet -- Enzyme Inhibition Constant Data from BindingDB
Found 3 hits for monomerid = 38543
Trg + Lig
Ki
nM
ΔG°
kcal/mole
IC50
nM
Kd
nM
EC50/IC50
nM
koff
s-1
kon
M-1s-1
pHTemp
°C
Mevalonate kinase
(Streptococcus pneumoniae D39)
BDBM38543
(2-(2-furoylamino)acetic acid [2-keto-2-(p-tolyl)et...)
Show SMILES Cc1ccc(cc1)C(=O)COC(=O)CNC(=O)c1ccco1
Show InChI InChI=1S/C16H15NO5/c1-11-4-6-12(7-5-11)13(18)10-22-15(19)9-17-16(20)14-3-2-8-21-14/h2-8H,9-10H2,1H3,(H,17,20)
PCBioAssay
n/an/a>1.00E+7n/an/an/an/an/an/a
SRMLSC
Curated by PubChem BioAssay
Assay Description
Southern Research Molecular Libraries Screening Center (SRMLSC) Southern Research Institute (Birmingham, Alabama) NIH Molecular Libraries Screening C...
PubChem Bioassay (2007)
BindingDB Entry DOI: 10.7270/Q27P8WSS
Mevalonate kinase
(Streptococcus pneumoniae D39)
BDBM38543
(2-(2-furoylamino)acetic acid [2-keto-2-(p-tolyl)et...)
Show SMILES Cc1ccc(cc1)C(=O)COC(=O)CNC(=O)c1ccco1
Show InChI InChI=1S/C16H15NO5/c1-11-4-6-12(7-5-11)13(18)10-22-15(19)9-17-16(20)14-3-2-8-21-14/h2-8H,9-10H2,1H3,(H,17,20)
PCBioAssay
n/an/a>1.00E+7n/an/an/an/an/an/a
SRMLSC
Curated by PubChem BioAssay
Assay Description
Southern Research Molecular Libraries Screening Center (SRMLSC) Southern Research Institute (Birmingham, Alabama) NIH Molecular Libraries Screening C...
PubChem Bioassay (2007)
BindingDB Entry DOI: 10.7270/Q2CF9NG2
Mevalonate kinase
(Streptococcus pneumoniae D39)
BDBM38543
(2-(2-furoylamino)acetic acid [2-keto-2-(p-tolyl)et...)
Show SMILES Cc1ccc(cc1)C(=O)COC(=O)CNC(=O)c1ccco1
Show InChI InChI=1S/C16H15NO5/c1-11-4-6-12(7-5-11)13(18)10-22-15(19)9-17-16(20)14-3-2-8-21-14/h2-8H,9-10H2,1H3,(H,17,20)
PCBioAssay
n/an/a>1.00E+7n/an/an/an/an/an/a
SRMLSC
Curated by PubChem BioAssay
Assay Description
Southern Research Molecular Libraries Screening Center (SRMLSC) Southern Research Institute (Birmingham, Alabama) NIH Molecular Libraries Screening C...
PubChem Bioassay (2007)
BindingDB Entry DOI: 10.7270/Q23X852V