BDBM38575 6-oxidanylidene-3-phenyl-8-(2,4,5-trimethoxyphenyl)-2,4,7,8-tetrahydropyrido[2,1-b][1,3,5]thiadiazine-9-carbonitrile::6-oxo-3-phenyl-8-(2,4,5-trimethoxyphenyl)-2,4,7,8-tetrahydropyrido[2,1-b][1,3,5]thiadiazine-9-carbonitrile::8-asaryl-6-keto-3-phenyl-2,4,7,8-tetrahydropyrido[2,1-b][1,3,5]thiadiazine-9-carbonitrile::MLS000080657::SMR000035439::cid_667069
SMILES: COc1cc(OC)c(cc1OC)C1CC(=O)N2CN(CSC2=C1C#N)c1ccccc1
InChI Key: InChIKey=RZIAEFGZOOVYAC-UHFFFAOYSA-N
Data: 8 IC50
Activity Spreadsheet -- Enzyme Inhibition Constant Data from BindingDB
Found 8 hits for monomerid = 38575
Trg + Lig
Ki
nM
ΔG°
kcal/mole
IC50
nM
Kd
nM
EC50/IC50
nM
koff
s-1
kon
M-1s-1
pHTemp
°C
mevalonate kinase
(Streptococcus pneumoniae D39)
BDBM38575
(6-oxidanylidene-3-phenyl-8-(2,4,5-trimethoxyphenyl...)
Show SMILES COc1cc(OC)c(cc1OC)C1CC(=O)N2CN(CSC2=C1C#N)c1ccccc1 |c:23|
Show InChI InChI=1S/C23H23N3O4S/c1-28-19-11-21(30-3)20(29-2)9-17(19)16-10-22(27)26-13-25(15-7-5-4-6-8-15)14-31-23(26)18(16)12-24/h4-9,11,16H,10,13-14H2,1-3H3
PCBioAssay
n/an/a>1.00E+7n/an/an/an/an/an/a
SRMLSC
Curated by PubChem BioAssay
Assay Description
Southern Research Molecular Libraries Screening Center (SRMLSC) Southern Research Institute (Birmingham, Alabama) NIH Molecular Libraries Screening C...
PubChem Bioassay (2007)
BindingDB Entry DOI: 10.7270/Q27P8WSS
mevalonate kinase
(Streptococcus pneumoniae D39)
BDBM38575
(6-oxidanylidene-3-phenyl-8-(2,4,5-trimethoxyphenyl...)
Show SMILES COc1cc(OC)c(cc1OC)C1CC(=O)N2CN(CSC2=C1C#N)c1ccccc1 |c:23|
Show InChI InChI=1S/C23H23N3O4S/c1-28-19-11-21(30-3)20(29-2)9-17(19)16-10-22(27)26-13-25(15-7-5-4-6-8-15)14-31-23(26)18(16)12-24/h4-9,11,16H,10,13-14H2,1-3H3
PCBioAssay
n/an/a 2.93E+4n/an/an/an/an/an/a
SRMLSC
Curated by PubChem BioAssay
Assay Description
Southern Research Molecular Libraries Screening Center (SRMLSC) Southern Research Institute (Birmingham, Alabama) NIH Molecular Libraries Screening C...
PubChem Bioassay (2007)
BindingDB Entry DOI: 10.7270/Q23X852V
mevalonate kinase
(Streptococcus pneumoniae D39)
BDBM38575
(6-oxidanylidene-3-phenyl-8-(2,4,5-trimethoxyphenyl...)
Show SMILES COc1cc(OC)c(cc1OC)C1CC(=O)N2CN(CSC2=C1C#N)c1ccccc1 |c:23|
Show InChI InChI=1S/C23H23N3O4S/c1-28-19-11-21(30-3)20(29-2)9-17(19)16-10-22(27)26-13-25(15-7-5-4-6-8-15)14-31-23(26)18(16)12-24/h4-9,11,16H,10,13-14H2,1-3H3
PCBioAssay
n/an/a 1.09E+5n/an/an/an/an/an/a
SRMLSC
Curated by PubChem BioAssay
Assay Description
Southern Research Molecular Libraries Screening Center (SRMLSC) Southern Research Institute (Birmingham, Alabama) NIH Molecular Libraries Screening C...
PubChem Bioassay (2007)
BindingDB Entry DOI: 10.7270/Q2CF9NG2
glucose-6-phosphate dehydrogenase-6-phosphogluconolactonase
(Plasmodium falciparum 3D7)
BDBM38575
(6-oxidanylidene-3-phenyl-8-(2,4,5-trimethoxyphenyl...)
Show SMILES COc1cc(OC)c(cc1OC)C1CC(=O)N2CN(CSC2=C1C#N)c1ccccc1 |c:23|
Show InChI InChI=1S/C23H23N3O4S/c1-28-19-11-21(30-3)20(29-2)9-17(19)16-10-22(27)26-13-25(15-7-5-4-6-8-15)14-31-23(26)18(16)12-24/h4-9,11,16H,10,13-14H2,1-3H3
PCBioAssay
n/an/a>8.00E+4n/an/an/an/an/an/a
Burnham Center for Chemical Genomics
Curated by PubChem BioAssay
Assay Description
Data Source: Sanford-Burnham Center for Chemical Genomics (SBCCG) Source Affiliation: Sanford-Burnham Medical Research Institute (SBMRI, San Diego CA...
PubChem Bioassay (2011)
BindingDB Entry DOI: 10.7270/Q23T9FQ1
Glucose 6-phosphate dehydrogenase (G6PD)
(Homo sapiens (Human))
BDBM38575
(6-oxidanylidene-3-phenyl-8-(2,4,5-trimethoxyphenyl...)
Show SMILES COc1cc(OC)c(cc1OC)C1CC(=O)N2CN(CSC2=C1C#N)c1ccccc1 |c:23|
Show InChI InChI=1S/C23H23N3O4S/c1-28-19-11-21(30-3)20(29-2)9-17(19)16-10-22(27)26-13-25(15-7-5-4-6-8-15)14-31-23(26)18(16)12-24/h4-9,11,16H,10,13-14H2,1-3H3
PCBioAssay
n/an/a>8.00E+4n/an/an/an/an/an/a
Burnham Center for Chemical Genomics
Curated by PubChem BioAssay
Assay Description
Data Source: Sanford-Burnham Center for Chemical Genomics (SBCCG) Source Affiliation: Sanford-Burnham Medical Research Institute (SBMRI, San Diego CA...
PubChem Bioassay (2011)
BindingDB Entry DOI: 10.7270/Q2V12389
glucose-6-phosphate dehydrogenase-6-phosphogluconolactonase
(Plasmodium falciparum 3D7)
BDBM38575
(6-oxidanylidene-3-phenyl-8-(2,4,5-trimethoxyphenyl...)
Show SMILES COc1cc(OC)c(cc1OC)C1CC(=O)N2CN(CSC2=C1C#N)c1ccccc1 |c:23|
Show InChI InChI=1S/C23H23N3O4S/c1-28-19-11-21(30-3)20(29-2)9-17(19)16-10-22(27)26-13-25(15-7-5-4-6-8-15)14-31-23(26)18(16)12-24/h4-9,11,16H,10,13-14H2,1-3H3
PCBioAssay
n/an/a 1.15E+4n/an/an/an/an/an/a
Burnham Center for Chemical Genomics
Curated by PubChem BioAssay
Assay Description
Data Source: Sanford-Burnham Center for Chemical Genomics (SBCCG) Source Affiliation: Sanford-Burnham Medical Research Institute (SBMRI, San Diego CA...
PubChem Bioassay (2011)
BindingDB Entry DOI: 10.7270/Q2ZS2TZG
glucose-6-phosphate dehydrogenase-6-phosphogluconolactonase
(Plasmodium falciparum 3D7)
BDBM38575
(6-oxidanylidene-3-phenyl-8-(2,4,5-trimethoxyphenyl...)
Show SMILES COc1cc(OC)c(cc1OC)C1CC(=O)N2CN(CSC2=C1C#N)c1ccccc1 |c:23|
Show InChI InChI=1S/C23H23N3O4S/c1-28-19-11-21(30-3)20(29-2)9-17(19)16-10-22(27)26-13-25(15-7-5-4-6-8-15)14-31-23(26)18(16)12-24/h4-9,11,16H,10,13-14H2,1-3H3
PCBioAssay
n/an/a>8.00E+4n/an/an/an/an/an/a
Burnham Center for Chemical Genomics
Curated by PubChem BioAssay
Assay Description
Data Source: Sanford-Burnham Center for Chemical Genomics (SBCCG) Source Affiliation: Sanford-Burnham Medical Research Institute (SBMRI, San Diego CA...
PubChem Bioassay (2011)
BindingDB Entry DOI: 10.7270/Q27H1H3W
Voltage-gated calcium channel subunit alpha Cav2.2
(Homo sapiens (Human))
BDBM38575
(6-oxidanylidene-3-phenyl-8-(2,4,5-trimethoxyphenyl...)
Show SMILES COc1cc(OC)c(cc1OC)C1CC(=O)N2CN(CSC2=C1C#N)c1ccccc1 |c:23|
Show InChI InChI=1S/C23H23N3O4S/c1-28-19-11-21(30-3)20(29-2)9-17(19)16-10-22(27)26-13-25(15-7-5-4-6-8-15)14-31-23(26)18(16)12-24/h4-9,11,16H,10,13-14H2,1-3H3
PCBioAssay
n/an/a 6.01E+3n/an/an/an/an/an/a
Burnham Center for Chemical Genomics
Curated by PubChem BioAssay
Assay Description
Data Source: Data Source: Sanford-Burnham Center for Chemical Genomics (SBCCG) Source Affiliation: Sanford-Burnham Medical Research Institute Network...
PubChem Bioassay (2009)
BindingDB Entry DOI: 10.7270/Q2PZ578V