BDBM3866 1-Phenylbenzimidazole deriv. 83::1-phenyl-1H-1,3-benzodiazol-6-amine::6-Amino-1-phenylbenzimidazole Dihydrochloride
SMILES: Nc1ccc2ncn(-c3ccccc3)c2c1
InChI Key: InChIKey=QDAPSNHOGORDJA-UHFFFAOYSA-N
Data: 2 IC50
Activity Spreadsheet -- Enzyme Inhibition Constant Data from BindingDB
Found 2 hits for monomerid = 3866
Trg + Lig
Ki
nM
ΔG°
kcal/mole
IC50
nM
Kd
nM
EC50/IC50
nM
koff
s-1
kon
M-1s-1
pHTemp
°C
Fibroblast growth factor receptor 1
(Homo sapiens (Human))
BDBM3866
(1-Phenylbenzimidazole deriv. 83 | 1-phenyl-1H-1,3-...)
Show SMILES Nc1ccc2ncn(-c3ccccc3)c2c1
Show InChI InChI=1S/C13H11N3/c14-10-6-7-12-13(8-10)16(9-15-12)11-4-2-1-3-5-11/h1-9H,14H2
NCI pathway
Reactome pathway
n/an/a>5.00E+4n/an/an/an/an/an/a
University of Auckland
Assay Description
IC50 is the inhibitor concentration which inhibits 50% of kinase activity that catalyzes the transfer of the terminal phosphate from [gamma-32P] labe...
J Med Chem 41: 5457-65 (1998)
Article DOI: 10.1021/jm9804681
BindingDB Entry DOI: 10.7270/Q24T6GJC
Platelet-derived growth factor receptor beta
(Homo sapiens (Human))
BDBM3866
(1-Phenylbenzimidazole deriv. 83 | 1-phenyl-1H-1,3-...)
Show SMILES Nc1ccc2ncn(-c3ccccc3)c2c1
Show InChI InChI=1S/C13H11N3/c14-10-6-7-12-13(8-10)16(9-15-12)11-4-2-1-3-5-11/h1-9H,14H2
NCI pathway
Reactome pathway
n/an/a 2.30E+4n/an/an/an/an/an/a
University of Auckland
Assay Description
IC50 is the inhibitor concentration which inhibits 50% of kinase activity that catalyzes the transfer of the terminal phosphate from [gamma-32P] labe...
J Med Chem 41: 5457-65 (1998)
Article DOI: 10.1021/jm9804681
BindingDB Entry DOI: 10.7270/Q24T6GJC