null
SMILES: [O-][N+](=O)c1cccc2ncn(-c3ccccc3)c12
InChI Key: InChIKey=CZLYARMVYSWJEL-UHFFFAOYSA-N
Activity Spreadsheet -- Enzyme Inhibition Constant Data from BindingDB
Found 2 hits for monomerid = 3874
Trg + Lig
Ki
nM
ΔG°
kcal/mole
IC50
nM
Kd
nM
EC50/IC50
nM
koff
s-1
kon
M-1s-1
pHTemp
°C
Fibroblast growth factor receptor 1
(Homo sapiens (Human))
BDBM3874
(1-Phenylbenzimidazole deriv. 91 | 7-nitro-1-phenyl...)
Show SMILES [O-][N+](=O)c1cccc2ncn(-c3ccccc3)c12
Show InChI InChI=1S/C13H9N3O2/c17-16(18)12-8-4-7-11-13(12)15(9-14-11)10-5-2-1-3-6-10/h1-9H
NCI pathway
Reactome pathway
n/an/a 4.00E+4n/an/an/an/an/an/a
University of Auckland
Assay Description
IC50 is the inhibitor concentration which inhibits 50% of kinase activity that catalyzes the transfer of the terminal phosphate from [gamma-32P] labe...
J Med Chem 41: 5457-65 (1998)
Article DOI: 10.1021/jm9804681
BindingDB Entry DOI: 10.7270/Q24T6GJC
Platelet-derived growth factor receptor beta
(Homo sapiens (Human))
BDBM3874
(1-Phenylbenzimidazole deriv. 91 | 7-nitro-1-phenyl...)
Show SMILES [O-][N+](=O)c1cccc2ncn(-c3ccccc3)c12
Show InChI InChI=1S/C13H9N3O2/c17-16(18)12-8-4-7-11-13(12)15(9-14-11)10-5-2-1-3-6-10/h1-9H
NCI pathway
Reactome pathway
n/an/a>5.00E+4n/an/an/an/an/an/a
University of Auckland
Assay Description
IC50 is the inhibitor concentration which inhibits 50% of kinase activity that catalyzes the transfer of the terminal phosphate from [gamma-32P] labe...
J Med Chem 41: 5457-65 (1998)
Article DOI: 10.1021/jm9804681
BindingDB Entry DOI: 10.7270/Q24T6GJC