null
SMILES: OB(O)[C@H](Cc1coc2ccccc12)NC(=O)Cc1cccnc1
InChI Key: InChIKey=ZKQWMHKXJMGVFF-INIZCTEOSA-N
Activity Spreadsheet -- Enzyme Inhibition Constant Data from BindingDB
Found 2 hits for monomerid = 388311
Trg + Lig
Ki
nM
ΔG°
kcal/mole
IC50
nM
Kd
nM
EC50/IC50
nM
koff
s-1
kon
M-1s-1
pHTemp
°C
Proteasome subunit beta type-5
(Homo sapiens (Human))
BDBM388311
(US10294246, Compound No. 8)
Show SMILES OB(O)[C@H](Cc1coc2ccccc12)NC(=O)Cc1cccnc1 |r|
Show InChI InChI=1S/C17H17BN2O4/c21-17(8-12-4-3-7-19-10-12)20-16(18(22)23)9-13-11-24-15-6-2-1-5-14(13)15/h1-7,10-11,16,22-23H,8-9H2,(H,20,21)/t16-/m0/s1
Reactome pathway
US Patent
n/an/a 275n/an/an/an/an/an/a
Schering-Plough Research Institute
Assay Description
Measurement of Beta5 inhibition is performed in 384 well format based on fluorescence intensity assay.Purified human constitutive proteasome (1.25 nM...
Bioorg Med Chem Lett 19: 1164-7 (2009)
BindingDB Entry DOI: 10.7270/Q2V40XHN
Proteasome subunit beta type-8
(Homo sapiens (Human))
BDBM388311
(US10294246, Compound No. 8)
Show SMILES OB(O)[C@H](Cc1coc2ccccc12)NC(=O)Cc1cccnc1 |r|
Show InChI InChI=1S/C17H17BN2O4/c21-17(8-12-4-3-7-19-10-12)20-16(18(22)23)9-13-11-24-15-6-2-1-5-14(13)15/h1-7,10-11,16,22-23H,8-9H2,(H,20,21)/t16-/m0/s1
Reactome pathway
US Patent
n/an/a<50n/an/an/an/an/an/a
Schering-Plough Research Institute
Assay Description
Measurement of LMP7 inhibition is performed in 384 well format based on fluorescence intensity assay.Purified human immunoproteasome (0.25 nM) and se...
Bioorg Med Chem Lett 19: 1164-7 (2009)
BindingDB Entry DOI: 10.7270/Q2V40XHN