BDBM389588 N'-{2-[(E)-2-(3,4- difluorophenyl)vinyl]quinazolin-4- yl}-N,N-diethylethane-1,2-diamine::US9951029, 93
SMILES: CCN(CC)CCNc1nc(\C=C\c2ccc(F)c(F)c2)nc2ccccc12
InChI Key: InChIKey=BEHCAZIALDEDOS-ZRDIBKRKSA-N
Data: 2 IC50
Activity Spreadsheet -- Enzyme Inhibition Constant Data from BindingDB
Found 2 hits for monomerid = 389588
Trg + Lig
Ki
nM
ΔG°
kcal/mole
IC50
nM
Kd
nM
EC50/IC50
nM
koff
s-1
kon
M-1s-1
pHTemp
°C
Receptor-type tyrosine-protein kinase FLT3
(Homo sapiens (Human))
BDBM389588
(N'-{2-[(E)-2-(3,4- difluorophenyl)vinyl]quinazolin...)
Show SMILES CCN(CC)CCNc1nc(\C=C\c2ccc(F)c(F)c2)nc2ccccc12
Show InChI InChI=1S/C22H24F2N4/c1-3-28(4-2)14-13-25-22-17-7-5-6-8-20(17)26-21(27-22)12-10-16-9-11-18(23)19(24)15-16/h5-12,15H,3-4,13-14H2,1-2H3,(H,25,26,27)/b12-10+
n/an/a 3.55E+3n/an/an/an/an/an/a
Vichem Chemie Research Ltd
Curated by ChEMBL
Assay Description
Inhibition of FLT3 ITD mutant (unknown origin) using TAMRA-Src-tide as substrate measured after 1 hr in presence of ATP at its Km concentration by IM...
Eur J Med Chem 184: (2019)
Article DOI: 10.1016/j.ejmech.2019.111710
Receptor-type tyrosine-protein kinase FLT3
(Homo sapiens (Human))
BDBM389588
(N'-{2-[(E)-2-(3,4- difluorophenyl)vinyl]quinazolin...)
Show SMILES CCN(CC)CCNc1nc(\C=C\c2ccc(F)c(F)c2)nc2ccccc12
Show InChI InChI=1S/C22H24F2N4/c1-3-28(4-2)14-13-25-22-17-7-5-6-8-20(17)26-21(27-22)12-10-16-9-11-18(23)19(24)15-16/h5-12,15H,3-4,13-14H2,1-2H3,(H,25,26,27)/b12-10+
US Patent
n/an/a 3.25E+3n/an/an/an/an/an/a
Georgia Institute of Technology
Assay Description
FLT3(ITD) biochemical assays were performed on two different assay system platforms, using TranscreenerŽ ADP Assay FP method (BellBrook Labs, Madison...
J Med Chem 52: 456-68 (2009)
BindingDB Entry DOI: 10.7270/Q2NG4T0S