BDBM39139 3-chloranyl-1-(2,4-dichlorophenyl)-4-(4-methylpiperazin-1-yl)pyrrole-2,5-dione::3-chloro-1-(2,4-dichlorophenyl)-4-(4-methyl-1-piperazinyl)pyrrole-2,5-dione::3-chloro-1-(2,4-dichlorophenyl)-4-(4-methylpiperazin-1-yl)pyrrole-2,5-dione::3-chloro-1-(2,4-dichlorophenyl)-4-(4-methylpiperazino)-3-pyrroline-2,5-quinone::MLS-0090829.0001::cid_1673604
SMILES: CN1CCN(CC1)C1=C(Cl)C(=O)N(C1=O)c1ccc(Cl)cc1Cl
InChI Key: InChIKey=IMYYMBDKTCFMLO-UHFFFAOYSA-N
Data: 2 IC50
Activity Spreadsheet -- Enzyme Inhibition Constant Data from BindingDB
Found 2 hits for monomerid = 39139
Trg + Lig
Ki
nM
ΔG°
kcal/mole
IC50
nM
Kd
nM
EC50/IC50
nM
koff
s-1
kon
M-1s-1
pHTemp
°C
Bfl-1
(Mus musculus (Mouse))
BDBM39139
(3-chloranyl-1-(2,4-dichlorophenyl)-4-(4-methylpipe...)
Show SMILES CN1CCN(CC1)C1=C(Cl)C(=O)N(C1=O)c1ccc(Cl)cc1Cl |c:8|
Show InChI InChI=1S/C15H14Cl3N3O2/c1-19-4-6-20(7-5-19)13-12(18)14(22)21(15(13)23)11-3-2-9(16)8-10(11)17/h2-3,8H,4-7H2,1H3
PCBioAssay
n/an/a 1.36E+3n/an/an/an/an/an/a
Sanford-Burnham Center for Chemical Genomics
Curated by PubChem BioAssay
Assay Description
Sanford-Burnham Center for Chemical Genomics (SBCCG) Sanford-Burnham Medical Research Institute (San Diego, CA) NIH Molecular Libraries Screening Cen...
PubChem Bioassay (2008)
BindingDB Entry DOI: 10.7270/Q2K072NW
Bfl-1
(Mus musculus (Mouse))
BDBM39139
(3-chloranyl-1-(2,4-dichlorophenyl)-4-(4-methylpipe...)
Show SMILES CN1CCN(CC1)C1=C(Cl)C(=O)N(C1=O)c1ccc(Cl)cc1Cl |c:8|
Show InChI InChI=1S/C15H14Cl3N3O2/c1-19-4-6-20(7-5-19)13-12(18)14(22)21(15(13)23)11-3-2-9(16)8-10(11)17/h2-3,8H,4-7H2,1H3
PCBioAssay
n/an/a 2.62E+3n/an/an/an/an/an/a
Sanford-Burnham Center for Chemical Genomics
Curated by PubChem BioAssay
Assay Description
Data Source: Sanford-Burnham Center for Chemical Genomics (SBCCG) Source Affiliation: Sanford-Burnham Medical Research Institute (SBMRI, San Diego, C...
PubChem Bioassay (2008)
BindingDB Entry DOI: 10.7270/Q2X065GM