null
SMILES: CC1CN(CCN1)C1=C(Cl)C(=O)N(C1=O)c1ccc(Cl)c(Cl)c1
InChI Key: InChIKey=WUMYVNAGGQHXJW-UHFFFAOYSA-N
Activity Spreadsheet -- Enzyme Inhibition Constant Data from BindingDB
Found 2 hits for monomerid = 39158
Trg + Lig
Ki
nM
ΔG°
kcal/mole
IC50
nM
Kd
nM
EC50/IC50
nM
koff
s-1
kon
M-1s-1
pHTemp
°C
Bcl-2-related protein A1
(Mus musculus (Mouse))
BDBM39158
(3-chloranyl-1-(3,4-dichlorophenyl)-4-(3-methylpipe...)
Show SMILES CC1CN(CCN1)C1=C(Cl)C(=O)N(C1=O)c1ccc(Cl)c(Cl)c1 |c:8|
Show InChI InChI=1S/C15H14Cl3N3O2/c1-8-7-20(5-4-19-8)13-12(18)14(22)21(15(13)23)9-2-3-10(16)11(17)6-9/h2-3,6,8,19H,4-5,7H2,1H3
PCBioAssay
n/an/a 1.95E+3n/an/an/an/an/an/a
Sanford-Burnham Center for Chemical Genomics
Curated by PubChem BioAssay
Assay Description
Sanford-Burnham Center for Chemical Genomics (SBCCG) Sanford-Burnham Medical Research Institute (San Diego, CA) NIH Molecular Libraries Screening Cen...
PubChem Bioassay (2008)
BindingDB Entry DOI: 10.7270/Q2K072NW
Bcl-2-related protein A1
(Mus musculus (Mouse))
BDBM39158
(3-chloranyl-1-(3,4-dichlorophenyl)-4-(3-methylpipe...)
Show SMILES CC1CN(CCN1)C1=C(Cl)C(=O)N(C1=O)c1ccc(Cl)c(Cl)c1 |c:8|
Show InChI InChI=1S/C15H14Cl3N3O2/c1-8-7-20(5-4-19-8)13-12(18)14(22)21(15(13)23)9-2-3-10(16)11(17)6-9/h2-3,6,8,19H,4-5,7H2,1H3
PCBioAssay
n/an/a 6.96E+3n/an/an/an/an/an/a
Sanford-Burnham Center for Chemical Genomics
Curated by PubChem BioAssay
Assay Description
Data Source: Sanford-Burnham Center for Chemical Genomics (SBCCG) Source Affiliation: Sanford-Burnham Medical Research Institute (SBMRI, San Diego, C...
PubChem Bioassay (2008)
BindingDB Entry DOI: 10.7270/Q2X065GM