BDBM39162 3-chloranyl-1-(3,4-dichlorophenyl)-4-[4-(3-methoxyphenyl)piperazin-1-yl]pyrrole-2,5-dione::3-chloro-1-(3,4-dichlorophenyl)-4-(4-(3-methoxyphenyl)piperazin-1-yl)-1H-pyrrole-2,5-dione::3-chloro-1-(3,4-dichlorophenyl)-4-[4-(3-methoxyphenyl)-1-piperazinyl]pyrrole-2,5-dione::3-chloro-1-(3,4-dichlorophenyl)-4-[4-(3-methoxyphenyl)piperazin-1-yl]pyrrole-2,5-dione::3-chloro-1-(3,4-dichlorophenyl)-4-[4-(3-methoxyphenyl)piperazino]-3-pyrroline-2,5-quinone::CHEMBL1272210::MLS-0090882.0001::cid_16654677
SMILES: COc1cccc(c1)N1CCN(CC1)C1=C(Cl)C(=O)N(C1=O)c1ccc(Cl)c(Cl)c1
InChI Key: InChIKey=DMHGHAFCFRGIAY-UHFFFAOYSA-N
Data: 4 IC50
Activity Spreadsheet -- Enzyme Inhibition Constant Data from BindingDB
Found 4 hits for monomerid = 39162
Trg + Lig
Ki
nM
ΔG°
kcal/mole
IC50
nM
Kd
nM
EC50/IC50
nM
koff
s-1
kon
M-1s-1
pHTemp
°C
Bfl-1
(Mus musculus (Mouse))
BDBM39162
(3-chloranyl-1-(3,4-dichlorophenyl)-4-[4-(3-methoxy...)
Show SMILES COc1cccc(c1)N1CCN(CC1)C1=C(Cl)C(=O)N(C1=O)c1ccc(Cl)c(Cl)c1 |c:16|
Show InChI InChI=1S/C21H18Cl3N3O3/c1-30-15-4-2-3-13(11-15)25-7-9-26(10-8-25)19-18(24)20(28)27(21(19)29)14-5-6-16(22)17(23)12-14/h2-6,11-12H,7-10H2,1H3
PCBioAssay
n/an/a 1.26E+3n/an/an/an/an/an/a
Sanford-Burnham Center for Chemical Genomics
Curated by PubChem BioAssay
Assay Description
Data Source: Sanford-Burnham Center for Chemical Genomics (SBCCG) Source Affiliation: Sanford-Burnham Medical Research Institute (SBMRI, San Diego, C...
PubChem Bioassay (2008)
BindingDB Entry DOI: 10.7270/Q2X065GM
Bcl-2-related protein A1
(Homo sapiens (Human))
BDBM39162
(3-chloranyl-1-(3,4-dichlorophenyl)-4-[4-(3-methoxy...)
Show SMILES COc1cccc(c1)N1CCN(CC1)C1=C(Cl)C(=O)N(C1=O)c1ccc(Cl)c(Cl)c1 |c:16|
Show InChI InChI=1S/C21H18Cl3N3O3/c1-30-15-4-2-3-13(11-15)25-7-9-26(10-8-25)19-18(24)20(28)27(21(19)29)14-5-6-16(22)17(23)12-14/h2-6,11-12H,7-10H2,1H3
NCI pathway
n/an/a 5.00E+3n/an/an/an/an/an/a
Human BioMolecular Research Institute
Curated by ChEMBL
Assay Description
Inhibition of N-terminal FITC BH3 peptide binding to GST-tagged Bfl1 by time resolved-FRET assay
Bioorg Med Chem Lett 20: 6560-4 (2010)
Article DOI: 10.1016/j.bmcl.2010.09.046
BindingDB Entry DOI: 10.7270/Q27D2VCZ
Bcl-2-related protein A1
(Homo sapiens (Human))
BDBM39162
(3-chloranyl-1-(3,4-dichlorophenyl)-4-[4-(3-methoxy...)
Show SMILES COc1cccc(c1)N1CCN(CC1)C1=C(Cl)C(=O)N(C1=O)c1ccc(Cl)c(Cl)c1 |c:16|
Show InChI InChI=1S/C21H18Cl3N3O3/c1-30-15-4-2-3-13(11-15)25-7-9-26(10-8-25)19-18(24)20(28)27(21(19)29)14-5-6-16(22)17(23)12-14/h2-6,11-12H,7-10H2,1H3
NCI pathway
n/an/a 1.20E+3n/an/an/an/an/an/a
Human BioMolecular Research Institute
Curated by ChEMBL
Assay Description
Inhibition of N-terminal FITC BH3 peptide binding to GST-tagged Bfl1 by fluorescence polarization assay
Bioorg Med Chem Lett 20: 6560-4 (2010)
Article DOI: 10.1016/j.bmcl.2010.09.046
BindingDB Entry DOI: 10.7270/Q27D2VCZ
Bfl-1
(Mus musculus (Mouse))
BDBM39162
(3-chloranyl-1-(3,4-dichlorophenyl)-4-[4-(3-methoxy...)
Show SMILES COc1cccc(c1)N1CCN(CC1)C1=C(Cl)C(=O)N(C1=O)c1ccc(Cl)c(Cl)c1 |c:16|
Show InChI InChI=1S/C21H18Cl3N3O3/c1-30-15-4-2-3-13(11-15)25-7-9-26(10-8-25)19-18(24)20(28)27(21(19)29)14-5-6-16(22)17(23)12-14/h2-6,11-12H,7-10H2,1H3
PCBioAssay
n/an/a 4.83E+3n/an/an/an/an/an/a
Sanford-Burnham Center for Chemical Genomics
Curated by PubChem BioAssay
Assay Description
Sanford-Burnham Center for Chemical Genomics (SBCCG) Sanford-Burnham Medical Research Institute (San Diego, CA) NIH Molecular Libraries Screening Cen...
PubChem Bioassay (2008)
BindingDB Entry DOI: 10.7270/Q2K072NW