BDBM392 (3S)-3,6-dihydro-2H-pyran-3-yl N-[(2S,3R)-4-[(4aS,8aS)-3-(tert-butylcarbamoyl)-decahydroisoquinolin-2-yl]-3-hydroxy-1-phenylbutan-2-yl]carbamate::Urethane deriv. 11
SMILES: [H][C@@]12CCCC[C@]1([H])CN(C[C@@H](O)[C@H](Cc1ccccc1)NC(=O)O[C@@H]1COCC=C1)C(C2)C(=O)NC(C)(C)C
InChI Key: InChIKey=LYPBPTICLJCIAA-YAAGLGSPSA-N
Data: 1 IC50
Activity Spreadsheet -- Enzyme Inhibition Constant Data from BindingDB
Found 1 hit for monomerid = 392
Trg + Lig
Ki
nM
ΔG°
kcal/mole
IC50
nM
Kd
nM
EC50/IC50
nM
koff
s-1
kon
M-1s-1
pHTemp
°C
HIV-1 Protease
(Human immunodeficiency virus type 1)
BDBM392
((3S)-3,6-dihydro-2H-pyran-3-yl N-[(2S,3R)-4-[(4aS,...)
Show SMILES [H][C@@]12CCCC[C@]1([H])CN(C[C@@H](O)[C@H](Cc1ccccc1)NC(=O)O[C@@H]1COCC=C1)C(C2)C(=O)NC(C)(C)C |r,c:31|
Show InChI InChI=1S/C30H45N3O5/c1-30(2,3)32-28(35)26-17-22-12-7-8-13-23(22)18-33(26)19-27(34)25(16-21-10-5-4-6-11-21)31-29(36)38-24-14-9-15-37-20-24/h4-6,9-11,14,22-27,34H,7-8,12-13,15-20H2,1-3H3,(H,31,36)(H,32,35)/t22-,23+,24-,25-,26?,27+/m0/s1
n/an/a 314n/an/an/an/a5.530
Merck Research Laboratories
Assay Description
Sensitivity of HIV-1 protease activity to protease inhibitors was determined by a peptide substrate cleavage assay. Protease products were analyzed o...
J Med Chem 36: 292-4 (1993)
Article DOI: 10.1021/jm00054a015
BindingDB Entry DOI: 10.7270/Q25D8Q1G