BDBM3926 5-(2-Aminoethoxy)-1-phenylbenzimidazole Dihydrochloride::5-(2-aminoethoxy)-1-phenyl-1H-1,3-benzodiazole::5-Substituted 1-Phenylbenzimidazole 15
SMILES: NCCOc1ccc2n(cnc2c1)-c1ccccc1
InChI Key: InChIKey=FRNOZBQRWVZMPL-UHFFFAOYSA-N
Data: 3 IC50
Activity Spreadsheet -- Enzyme Inhibition Constant Data from BindingDB
Found 3 hits for monomerid = 3926
Trg + Lig
Ki
nM
ΔG°
kcal/mole
IC50
nM
Kd
nM
EC50/IC50
nM
koff
s-1
kon
M-1s-1
pHTemp
°C
Platelet-derived growth factor receptor beta
(Homo sapiens (Human))
BDBM3926
(5-(2-Aminoethoxy)-1-phenylbenzimidazole Dihydrochl...)
Show SMILES NCCOc1ccc2n(cnc2c1)-c1ccccc1
Show InChI InChI=1S/C15H15N3O/c16-8-9-19-13-6-7-15-14(10-13)17-11-18(15)12-4-2-1-3-5-12/h1-7,10-11H,8-9,16H2
NCI pathway
Reactome pathway
n/an/a 650n/an/an/an/a7.425
University of Auckland
Assay Description
IC50 is the inhibitor concentration which inhibits 50% of kinase activity that catalyzes the transfer of the terminal phosphate from [gamma-32P] labe...
J Med Chem 42: 2373-82 (1999)
Article DOI: 10.1021/jm980658b
BindingDB Entry DOI: 10.7270/Q2W957B2
Proto-oncogene tyrosine-protein kinase Src
(Homo sapiens (Human))
BDBM3926
(5-(2-Aminoethoxy)-1-phenylbenzimidazole Dihydrochl...)
Show SMILES NCCOc1ccc2n(cnc2c1)-c1ccccc1
Show InChI InChI=1S/C15H15N3O/c16-8-9-19-13-6-7-15-14(10-13)17-11-18(15)12-4-2-1-3-5-12/h1-7,10-11H,8-9,16H2
n/an/a>5.00E+4n/an/an/an/an/an/a
University of Auckland
Assay Description
IC50 is the inhibitor concentration which inhibits 50% of kinase activity that catalyzes the transfer of the terminal phosphate from [gamma-32P] labe...
J Med Chem 42: 2373-82 (1999)
Article DOI: 10.1021/jm980658b
BindingDB Entry DOI: 10.7270/Q2W957B2
Fibroblast growth factor receptor 1
(Homo sapiens (Human))
BDBM3926
(5-(2-Aminoethoxy)-1-phenylbenzimidazole Dihydrochl...)
Show SMILES NCCOc1ccc2n(cnc2c1)-c1ccccc1
Show InChI InChI=1S/C15H15N3O/c16-8-9-19-13-6-7-15-14(10-13)17-11-18(15)12-4-2-1-3-5-12/h1-7,10-11H,8-9,16H2
NCI pathway
Reactome pathway
n/an/a 2.70E+4n/an/an/an/an/an/a
University of Auckland
Assay Description
IC50 is the inhibitor concentration which inhibits 50% of kinase activity that catalyzes the transfer of the terminal phosphate from [gamma-32P] labe...
J Med Chem 42: 2373-82 (1999)
Article DOI: 10.1021/jm980658b
BindingDB Entry DOI: 10.7270/Q2W957B2