BDBM392879 US10301306, Example 77
SMILES: Fc1ccc(cc1)-c1c2c(CCNC2=O)n(Cc2c(F)cccc2C#N)c1-c1ccncc1
InChI Key: InChIKey=JLNKMONALXMHAM-UHFFFAOYSA-N
Data: 1 IC50
Activity Spreadsheet -- Enzyme Inhibition Constant Data from BindingDB
Found 1 hit for monomerid = 392879
Trg + Lig
Ki
nM
ΔG°
kcal/mole
IC50
nM
Kd
nM
EC50/IC50
nM
koff
s-1
kon
M-1s-1
pHTemp
°C
Receptor-interacting serine/threonine-protein kinase 3
(Homo sapiens (Human))
BDBM392879
(US10301306, Example 77)
Show SMILES Fc1ccc(cc1)-c1c2c(CCNC2=O)n(Cc2c(F)cccc2C#N)c1-c1ccncc1
Show InChI InChI=1S/C26H18F2N4O/c27-19-6-4-16(5-7-19)23-24-22(10-13-31-26(24)33)32(25(23)17-8-11-30-12-9-17)15-20-18(14-29)2-1-3-21(20)28/h1-9,11-12H,10,13,15H2,(H,31,33)
Reactome pathway
US Patent
n/an/a<30n/an/an/an/an/an/a
GSK
Assay Description
The assays were performed in black 1536-well plates. The final assay volume of 2 μl contained a mixture of a fluorescently labeled HTRF probe, T...
Bioorg Med Chem Lett 18: 5018-22 (2008)
BindingDB Entry DOI: 10.7270/Q2M90C19