BDBM3950 5-Hydroxy-6-methyl-1-phenylbenzimidazole Hydrochloride::5-Substituted 1-Phenylbenzimidazole 39::6-methyl-1-phenyl-1H-1,3-benzodiazol-5-ol
SMILES: Cc1cc2n(cnc2cc1O)-c1ccccc1
InChI Key: InChIKey=UIFBZRWGJYZWIJ-UHFFFAOYSA-N
Data: 3 IC50
Activity Spreadsheet -- Enzyme Inhibition Constant Data from BindingDB
Found 3 hits for monomerid = 3950
Trg + Lig
Ki
nM
ΔG°
kcal/mole
IC50
nM
Kd
nM
EC50/IC50
nM
koff
s-1
kon
M-1s-1
pHTemp
°C
Platelet-derived growth factor receptor beta
(Homo sapiens (Human))
BDBM3950
(5-Hydroxy-6-methyl-1-phenylbenzimidazole Hydrochlo...)
Show SMILES Cc1cc2n(cnc2cc1O)-c1ccccc1
Show InChI InChI=1S/C14H12N2O/c1-10-7-13-12(8-14(10)17)15-9-16(13)11-5-3-2-4-6-11/h2-9,17H,1H3
NCI pathway
Reactome pathway
n/an/a 2.50E+3n/an/an/an/an/an/a
University of Auckland
Assay Description
IC50 is the inhibitor concentration which inhibits 50% of kinase activity that catalyzes the transfer of the terminal phosphate from [gamma-32P] labe...
J Med Chem 42: 2373-82 (1999)
Article DOI: 10.1021/jm980658b
BindingDB Entry DOI: 10.7270/Q2W957B2
Proto-oncogene tyrosine-protein kinase Src
(Homo sapiens (Human))
BDBM3950
(5-Hydroxy-6-methyl-1-phenylbenzimidazole Hydrochlo...)
Show SMILES Cc1cc2n(cnc2cc1O)-c1ccccc1
Show InChI InChI=1S/C14H12N2O/c1-10-7-13-12(8-14(10)17)15-9-16(13)11-5-3-2-4-6-11/h2-9,17H,1H3
n/an/a>5.00E+4n/an/an/an/an/an/a
University of Auckland
Assay Description
IC50 is the inhibitor concentration which inhibits 50% of kinase activity that catalyzes the transfer of the terminal phosphate from [gamma-32P] labe...
J Med Chem 42: 2373-82 (1999)
Article DOI: 10.1021/jm980658b
BindingDB Entry DOI: 10.7270/Q2W957B2
Fibroblast growth factor receptor 1
(Homo sapiens (Human))
BDBM3950
(5-Hydroxy-6-methyl-1-phenylbenzimidazole Hydrochlo...)
Show SMILES Cc1cc2n(cnc2cc1O)-c1ccccc1
Show InChI InChI=1S/C14H12N2O/c1-10-7-13-12(8-14(10)17)15-9-16(13)11-5-3-2-4-6-11/h2-9,17H,1H3
NCI pathway
Reactome pathway
n/an/a>5.00E+4n/an/an/an/an/an/a
University of Auckland
Assay Description
IC50 is the inhibitor concentration which inhibits 50% of kinase activity that catalyzes the transfer of the terminal phosphate from [gamma-32P] labe...
J Med Chem 42: 2373-82 (1999)
Article DOI: 10.1021/jm980658b
BindingDB Entry DOI: 10.7270/Q2W957B2