BDBM39595 MLS000082269::N,N-dimethyl-4-(1-propan-2-yl-2-benzimidazolyl)aniline::N,N-dimethyl-4-(1-propan-2-ylbenzimidazol-2-yl)aniline::SMR000046198::[4-(1-isopropylbenzimidazol-2-yl)phenyl]-dimethyl-amine::cid_665078
SMILES: CC(C)n1c(nc2ccccc12)-c1ccc(cc1)N(C)C
InChI Key: InChIKey=NFRZQEMCFZOKHW-UHFFFAOYSA-N
Data: 1 IC50  1 EC50
Activity Spreadsheet -- Enzyme Inhibition Constant Data from BindingDB
Found 2 hits for monomerid = 39595
Trg + Lig
Ki
nM
ΔG°
kcal/mole
IC50
nM
Kd
nM
EC50/IC50
nM
koff
s-1
kon
M-1s-1
pHTemp
°C
Alkaline phosphatase placental-like
(Homo sapiens (Human))
BDBM39595
(MLS000082269 | N,N-dimethyl-4-(1-propan-2-yl-2-ben...)
Show SMILES CC(C)n1c(nc2ccccc12)-c1ccc(cc1)N(C)C
Show InChI InChI=1S/C18H21N3/c1-13(2)21-17-8-6-5-7-16(17)19-18(21)14-9-11-15(12-10-14)20(3)4/h5-13H,1-4H3
PCBioAssay
n/an/an/an/a 8.52E+3n/an/an/an/a
Burnham Center for Chemical Genomics
Curated by PubChem BioAssay
Assay Description
Sanford-Burnham Center for Chemical Genomics (SBCCG) Sanford-Burnham Medical Research Institute (SBMRI, San Diego, CA) NIH Molecular Libraries Screen...
PubChem Bioassay (2007)
BindingDB Entry DOI: 10.7270/Q2RV0M49
Alkaline phosphatase placental-like
(Homo sapiens (Human))
BDBM39595
(MLS000082269 | N,N-dimethyl-4-(1-propan-2-yl-2-ben...)
Show SMILES CC(C)n1c(nc2ccccc12)-c1ccc(cc1)N(C)C
Show InChI InChI=1S/C18H21N3/c1-13(2)21-17-8-6-5-7-16(17)19-18(21)14-9-11-15(12-10-14)20(3)4/h5-13H,1-4H3
PCBioAssay
n/an/a 9.99E+5n/an/an/an/an/an/a
Burnham Center for Chemical Genomics
Curated by PubChem BioAssay
Assay Description
Sanford-Burnham Center for Chemical Genomics (SBCCG) Sanford-Burnham Medical Research Institute (SBMRI, San Diego, CA) NIH Molecular Libraries Screen...
PubChem Bioassay (2007)
BindingDB Entry DOI: 10.7270/Q2MS3R5M