BDBM396120 6-(5-Brom32.2-difluoromethoxy-pyridin-2-ylmethyl)-5-methyl-[1,2,5]oxadiazolo[3,4-b]pyridin-7-ylamine::US10308667, Example 23
SMILES: Cc1nc2nonc2c(N)c1Cc1ccc(Br)c(OC(F)F)n1
InChI Key: InChIKey=HIQVOMBRMURXJJ-UHFFFAOYSA-N
Data: 1 IC50
Activity Spreadsheet -- Enzyme Inhibition Constant Data from BindingDB
Found 1 hit for monomerid = 396120
Trg + Lig
Ki
nM
ΔG°
kcal/mole
IC50
nM
Kd
nM
EC50/IC50
nM
koff
s-1
kon
M-1s-1
pHTemp
°C
Ghrelin O-acyltransferase
(Homo sapiens (Human))
BDBM396120
(6-(5-Brom32.2-difluoromethoxy-pyridin-2-ylmethyl)-...)
Show SMILES Cc1nc2nonc2c(N)c1Cc1ccc(Br)c(OC(F)F)n1
Show InChI InChI=1S/C13H10BrF2N5O2/c1-5-7(9(17)10-11(18-5)21-23-20-10)4-6-2-3-8(14)12(19-6)22-13(15)16/h2-3,13H,4,17H2,1H3
US Patent
n/an/a 0.0820n/an/an/an/an/an/a
Boehringer Ingelheim Pharmaceuticals Inc.
Assay Description
Cells are plated with a density of 5000 cells/well in 384-well poly-D-lysin plates and incubated for 1 day at 37° C., 5% CO2 in DMEM medium, 10% FCS,...
Bioorg Med Chem Lett 17: 4664-9 (2007)
BindingDB Entry DOI: 10.7270/Q2VH5R5S