BDBM396215 6-(7-Amino-5-methyl-[1,2,5]oxadiazolo[3,4-b]pyridin-6-ylmethyl)-3-phenoxy-pyridine-2-carbonitrile::US10308667, Example 118
SMILES: Cc1nc2nonc2c(N)c1Cc1ccc(Oc2ccccc2)c(n1)C#N
InChI Key: InChIKey=PRSFXZAAJODJGI-UHFFFAOYSA-N
Data: 1 IC50
Activity Spreadsheet -- Enzyme Inhibition Constant Data from BindingDB
Found 1 hit for monomerid = 396215
Trg + Lig
Ki
nM
ΔG°
kcal/mole
IC50
nM
Kd
nM
EC50/IC50
nM
koff
s-1
kon
M-1s-1
pHTemp
°C
Ghrelin O-acyltransferase
(Homo sapiens (Human))
BDBM396215
(6-(7-Amino-5-methyl-[1,2,5]oxadiazolo[3,4-b]pyridi...)
Show SMILES Cc1nc2nonc2c(N)c1Cc1ccc(Oc2ccccc2)c(n1)C#N
Show InChI InChI=1S/C19H14N6O2/c1-11-14(17(21)18-19(22-11)25-27-24-18)9-12-7-8-16(15(10-20)23-12)26-13-5-3-2-4-6-13/h2-8H,9,21H2,1H3
US Patent
n/an/a 0.0850n/an/an/an/an/an/a
Boehringer Ingelheim Pharmaceuticals Inc.
Assay Description
Cells are plated with a density of 5000 cells/well in 384-well poly-D-lysin plates and incubated for 1 day at 37° C., 5% CO2 in DMEM medium, 10% FCS,...
Bioorg Med Chem Lett 17: 4664-9 (2007)
BindingDB Entry DOI: 10.7270/Q2VH5R5S