BDBM39807 CP-526,423
SMILES: Cc1ccc2[nH]c(cc2c1)C(=O)NCCOCCOCCNC(=O)c1cc2cc(Cl)ccc2[nH]1
InChI Key: InChIKey=AHZZVJKLSGUIDM-UHFFFAOYSA-N
Data: 1 IC50
Activity Spreadsheet -- Enzyme Inhibition Constant Data from BindingDB
Found 1 hit for monomerid = 39807
Trg + Lig
Ki
nM
ΔG°
kcal/mole
IC50
nM
Kd
nM
EC50/IC50
nM
koff
s-1
kon
M-1s-1
pHTemp
°C
Glycogen Phosphorylase (PYGL)
(Homo sapiens (Human))
BDBM39807
(CP-526,423)
Show SMILES Cc1ccc2[nH]c(cc2c1)C(=O)NCCOCCOCCNC(=O)c1cc2cc(Cl)ccc2[nH]1
Show InChI InChI=1S/C25H27ClN4O4/c1-16-2-4-20-17(12-16)14-22(29-20)24(31)27-6-8-33-10-11-34-9-7-28-25(32)23-15-18-13-19(26)3-5-21(18)30-23/h2-5,12-15,29-30H,6-11H2,1H3,(H,27,31)(H,28,32)
Reactome pathway
n/an/a 6n/an/an/an/a7.222
Pfizer Inc
Assay Description
Human liver glycogen phsphorylase (HLGP) activity was measured in the direction of glycogen synthesis by the release of phosphate from glucose-1-phos...
Chem Biol 7: 677-82 (2000)
Article DOI: 10.1016/S1074-5521(00)00004-1
BindingDB Entry DOI: 10.7270/Q2H41PT2