BDBM39813 Acylglycineboronic acid, 12
SMILES: OB(O)CNC(=O)CCl
InChI Key: InChIKey=BLGBFTVMRZPQPQ-UHFFFAOYSA-N
Data: 1 KI
Activity Spreadsheet -- Enzyme Inhibition Constant Data from BindingDB
Found 1 hit for monomerid = 39813
Trg + Lig
Ki
nM
ΔG°
kcal/mole
IC50
nM
Kd
nM
EC50/IC50
nM
koff
s-1
kon
M-1s-1
pHTemp
°C
Beta-lactamase AmpC
(Escherichia coli)
BDBM39813
(Acylglycineboronic acid, 12)
Show SMILES OB(O)CNC(=O)CCl
Show InChI InChI=1S/C3H7BClNO3/c5-1-3(7)6-2-4(8)9/h8-9H,1-2H2,(H,6,7)
240n/an/an/an/an/an/a7.0n/a
Northwestern University
Assay Description
Enzyme inhibition assay using AmpC or TEM-1 from escherichia coli.
Chem Biol 8: 17-31 (2001)
Article DOI: 10.1016/S1074-5521(00)00052-1
BindingDB Entry DOI: 10.7270/Q2CC0Z3R