BDBM39850 Amide and sulfonamide derivatives, 34
SMILES: OB(O)c1cccc(NS(=O)(=O)c2cc(Cl)c(Oc3ccc(cc3Cl)N(=O)=O)c(Cl)c2)c1
InChI Key: InChIKey=RPKNZBGVJUFYHA-UHFFFAOYSA-N
Data: 1 KI
Activity Spreadsheet -- Enzyme Inhibition Constant Data from BindingDB
Found 1 hit for monomerid = 39850
Trg + Lig
Ki
nM
ΔG°
kcal/mole
IC50
nM
Kd
nM
EC50/IC50
nM
koff
s-1
kon
M-1s-1
pHTemp
°C
Beta-lactamase AmpC
(Escherichia coli)
BDBM39850
(Amide and sulfonamide derivatives, 34)
Show SMILES OB(O)c1cccc(NS(=O)(=O)c2cc(Cl)c(Oc3ccc(cc3Cl)N(=O)=O)c(Cl)c2)c1
Show InChI InChI=1S/C18H12BCl3N2O7S/c20-14-7-12(24(27)28)4-5-17(14)31-18-15(21)8-13(9-16(18)22)32(29,30)23-11-3-1-2-10(6-11)19(25)26/h1-9,23,25-26H
200n/an/an/an/an/an/a7.0n/a
Northwestern University
Assay Description
Inhibition assay against beta lactamase enzymes.
Chem Biol 8: 593-611 (2001)
Article DOI: 10.1016/S1074-5521(01)00034-5
BindingDB Entry DOI: 10.7270/Q27M06BZ