BDBM39852 Amide and sulfonamide derivatives, 36
SMILES: OB(O)c1cccc(NS(=O)(=O)c2ccc(cc2)C(O)=O)c1
InChI Key: InChIKey=MFXIOQADMLRRPJ-UHFFFAOYSA-N
Data: 1 KI
Activity Spreadsheet -- Enzyme Inhibition Constant Data from BindingDB
Found 1 hit for monomerid = 39852
Trg + Lig
Ki
nM
ΔG°
kcal/mole
IC50
nM
Kd
nM
EC50/IC50
nM
koff
s-1
kon
M-1s-1
pHTemp
°C
Beta-lactamase AmpC
(Escherichia coli)
BDBM39852
(Amide and sulfonamide derivatives, 36)
Show SMILES OB(O)c1cccc(NS(=O)(=O)c2ccc(cc2)C(O)=O)c1
Show InChI InChI=1S/C13H12BNO6S/c16-13(17)9-4-6-12(7-5-9)22(20,21)15-11-3-1-2-10(8-11)14(18)19/h1-8,15,18-19H,(H,16,17)
620n/an/an/an/an/an/a7.0n/a
Northwestern University
Assay Description
Inhibition assay against beta lactamase enzymes.
Chem Biol 8: 593-611 (2001)
Article DOI: 10.1016/S1074-5521(01)00034-5
BindingDB Entry DOI: 10.7270/Q27M06BZ